{"text_format":"1","workbook":"xlsx","n_sheets":19,"sheets":["Rules","Simplified P&L","Budget Price 1st quotation","Budget Price Final order","Budget Target","Service Calculation","Calculation of commissions","Configuration","Main cover UK","Main cover FR","cover_L","PRICE_LIST","Feuil1","STS","Customer_services","Services_client","GTC","CGV","Agents"],"not_rendered":{"charts":0,"images":27,"macros":1,"external_links":0,"defined_names":38,"comments":6,"pivot_tables":0},"unopened":[],"bounds":{"document_bytes":16777216,"sheet_cells":100000,"rows_first":2000,"rows_last":500,"rows_between":2000,"halvings":0,"cell_chars":16384,"cell_head_chars":4096},"cells_cut":0,"cells_raw":0,"read":"whole","date_system":"1900"}

{"sheet":"Rules","index":0,"n_rows":51,"n_cols":9,"rows_kept":51,"cut":false,"hidden":false,"merged":[]}
["RULES "]
[]
[]
[null,"In budget price:"]
[null,null,"All white boxes : to be filled by AE. Must be representative of the offer display"]
[null,null,null,"Each line for EQ can include (or not) sold engineering studies (columns S to Z)"]
[null,null,null,"Only specific design related studies must be sold -> to be decided in Feasability review"]
[null,null,null,"Indicate a note on the EQ Unit Cost price if a big part was estimated: example : 50% from previous order MS0450, 25% estimated, 25% consulted "]
{"$rows_left_out":44}
{"sheet":"Simplified P&L","index":1,"n_rows":84,"n_cols":11,"rows_kept":84,"cut":false,"hidden":false,"merged":[[26,1,26,2],[7,1,7,2],[21,1,21,2],[8,3,11,10],[0,1,0,10],[4,6,6,10],[7,3,7,10],[17,0,18,2],[17,3,18,3],[17,6,18,6],[17,9,18,9],[17,10,18,10],[9,1,9,2],[5,1,5,2],[11,1,11,2]]}
[null,"SIMPLIFIED P&L"]
["Quotation :","725116",null,"DAS:",null,null,"FILTRATION ","ASM:",null,"CPIS"]
["Commercial offer version:",7,null,"TAC:",null,null,"EQUIPMENT","T eng. :",null,"ANGO"]
["Technical offer version:",7,null,"Incoterm",null,null,"DAP - Gelsa - Spain","P eng. :"]
[null,null,null,null,null,null,"45 weeks on EXW HASLER France workshop basis"]
["Customer :","St Gobain",null,"Lead time :"]
[]
["Market:","CCH - other",null,"Project description / comments: "]
{"$rows_left_out":77}
{"sheet":"Budget Price 1st quotation","index":2,"n_rows":35,"n_cols":27,"rows_kept":35,"cut":false,"hidden":false,"merged":[[0,19,0,26]]}
[null,null,null,null,null,null,null,null,null,null,null,null,null,null,null,null,null,null,null,"DIRECT HOURS SOLD"]
["Position","Type of Eqpt","Meca/Elec","Base / Options","DESCRIPTION","RÉFÉRENCE","QTY","TOTAL EQ Cost","TOTAL Hours cost","TOTAL Cost","EQ Unit selling price","Total Hours Selling Price","TOTAL EQ Selling Price","TOTAL Selling Price","Gross Margin on Direct External Costs","Gross Margin on Direct External Costs","Margin on EQ","Margin on hours","EQ Unit Cost ","Nb hours TECH","Hours Unit Cost","Nb hours PUR","Hours Unit Cost","Nb hours PM","Hours Unit Cost","Nb hours WORKSHOP","Hours Unit Cost"]
[1,null,null,"BASE",null,null,null,{"$f":"+S3*G3","v":0},{"$f":"T3*U3+V3*W3+X3*Y3+Z3*AA3","v":0},{"$f":"I3+H3","v":0},null,null,{"$f":"G3*K3","v":0},{"$f":"M3+L3","v":0},{"$f":"+N3-H3","v":0},{"$f":"IF(G3=\"\",\"\",+O3/N3)","v":""},{"$f":"IF(G3=\"\",\"\",(M3-H3)/M3)","v":""},{"$f":"IF(I3=0,\"\",(L3-I3)/L3)","v":""},null,null,{"$f":"'Simplified P&L'!$B$55","v":50},null,{"$f":"'Simplified P&L'!$B$58","v":50},null,{"$f":"'Simplified P&L'!$B$59","v":65},null,{"$f":"'Simplified P&L'!$B$60","v":40}]
[1,null,null,"BASE",null,null,null,{"$f":"+S4*G4","v":0},{"$f":"T4*U4+V4*W4+X4*Y4+Z4*AA4","v":0},{"$f":"I4+H4","v":0},null,null,{"$f":"G4*K4","v":0},{"$f":"M4+L4","v":0},{"$f":"+N4-H4","v":0},{"$f":"IF(G4=\"\",\"\",+O4/N4)","v":""},{"$f":"IF(G4=\"\",\"\",(M4-H4)/M4)","v":""},{"$f":"IF(I4=0,\"\",(L4-I4)/L4)","v":""},null,null,{"$f":"'Simplified P&L'!$B$55","v":50},null,{"$f":"'Simplified P&L'!$B$58","v":50},null,{"$f":"'Simplified P&L'!$B$59","v":65},null,{"$f":"'Simplified P&L'!$B$60","v":40}]
[1,null,null,"BASE",null,null,null,0,0,0,null,null,0,0,0,"",{"$f":"IF(G5=\"\",\"\",(M5-H5)/M5)","v":""},{"$f":"IF(I5=0,\"\",(L5-I5)/L5)","v":""},null,null,{"$f":"'Simplified P&L'!$B$55","v":50},null,{"$f":"'Simplified P&L'!$B$58","v":50},null,{"$f":"'Simplified P&L'!$B$59","v":65},null,{"$f":"'Simplified P&L'!$B$60","v":40}]
[1,null,null,"BASE",null,null,null,{"$f":"+S6*G6","v":0},{"$f":"T6*U6+V6*W6+X6*Y6+Z6*AA6","v":0},{"$f":"I6+H6","v":0},null,null,{"$f":"G6*K6","v":0},{"$f":"M6+L6","v":0},{"$f":"+N6-H6","v":0},{"$f":"IF(G6=\"\",\"\",+O6/N6)","v":""},{"$f":"IF(G6=\"\",\"\",(M6-H6)/M6)","v":""},{"$f":"IF(I6=0,\"\",(L6-I6)/L6)","v":""},null,null,{"$f":"'Simplified P&L'!$B$55","v":50},null,{"$f":"'Simplified P&L'!$B$58","v":50},null,{"$f":"'Simplified P&L'!$B$59","v":65},null,{"$f":"'Simplified P&L'!$B$60","v":40}]
[1,null,null,"BASE",null,null,null,0,0,0,null,null,0,0,0,"","","",null,null,{"$f":"'Simplified P&L'!$B$55","v":50},null,{"$f":"'Simplified P&L'!$B$58","v":50},null,{"$f":"'Simplified P&L'!$B$59","v":65},null,{"$f":"'Simplified P&L'!$B$60","v":40}]
[1,null,null,"BASE",null,null,null,0,0,0,null,null,0,0,0,"","","",null,null,{"$f":"'Simplified P&L'!$B$55","v":50},null,{"$f":"'Simplified P&L'!$B$58","v":50},null,{"$f":"'Simplified P&L'!$B$59","v":65},null,{"$f":"'Simplified P&L'!$B$60","v":40}]
{"$rows_left_out":28}
{"sheet":"Budget Price Final order","index":3,"n_rows":35,"n_cols":27,"rows_kept":35,"cut":false,"hidden":false,"merged":[[0,19,0,26]]}
[null,null,null,null,null,null,null,null,null,null,null,null,null,null,null,null,null,null,null,"DIRECT HOURS SOLD"]
["Position","Type of Eqpt","Meca/Elec","Base / Options","DESCRIPTION","RÉFÉRENCE","QTY","TOTAL EQ Cost","TOTAL Hours cost","TOTAL Cost","EQ Unit selling price","Total Hours Selling Price","TOTAL EQ Selling Price","TOTAL Selling Price","Gross Margin on Direct External Costs","Gross Margin on Direct External Costs","Margin on EQ","Margin on hours","EQ Unit Cost ","Nb hours TECH","Hours Unit Cost","Nb hours PUR","Hours Unit Cost","Nb hours PM","Hours Unit Cost","Nb hours WORKSHOP","Hours Unit Cost"]
[1,"EQUIPMENT","MECA","BASE","Engineering study",null,1,{"$f":"+S3*G3","v":0},{"$f":"T3*U3+V3*W3+X3*Y3+Z3*AA3","v":0},{"$f":"I3+H3","v":0},196540,null,{"$f":"G3*K3","v":196540},{"$f":"M3+L3","v":196540},{"$f":"+N3-H3","v":196540},{"$f":"IF(G3=\"\",\"\",+O3/N3)","v":1},{"$f":"IF(G3=\"\",\"\",(M3-H3)/M3)","v":1},{"$f":"IF(I3=0,\"\",(L3-I3)/L3)","v":""},0,null,{"$f":"'Simplified P&L'!$B$55","v":50},null,{"$f":"'Simplified P&L'!$B$58","v":50},null,{"$f":"'Simplified P&L'!$B$59","v":65},null,{"$f":"'Simplified P&L'!$B$60","v":40}]
[1,"EQUIPMENT","MECA","BASE","Horizontal Vacuum Belt Filter 6B10 (6m²)",null,1,{"$f":"+S4*G4","v":204729},{"$f":"T4*U4+V4*W4+X4*Y4+Z4*AA4","v":0},{"$f":"I4+H4","v":204729},196540,null,{"$f":"G4*K4","v":196540},{"$f":"M4+L4","v":196540},{"$f":"+N4-H4","v":-8189},{"$f":"IF(G4=\"\",\"\",+O4/N4)","v":-4.1665818662867608E-2},{"$f":"IF(G4=\"\",\"\",(M4-H4)/M4)","v":-4.1665818662867608E-2},{"$f":"IF(I4=0,\"\",(L4-I4)/L4)","v":""},204729,null,{"$f":"'Simplified P&L'!$B$55","v":50},null,{"$f":"'Simplified P&L'!$B$58","v":50},null,{"$f":"'Simplified P&L'!$B$59","v":65},null,{"$f":"'Simplified P&L'!$B$60","v":40}]
[1,"EQUIPMENT","MECA","BASE","-Connections inside Hasler filter will be as per EN1092-1-PN standard\n-Connections/Interfaces between Saint Gobain and Hasler scope will be as per ANSI standard",null,1,4500,{"$f":"T5*U5+V5*W5+X5*Y5+Z5*AA5","v":0},4500,4200,null,4200,4200,-300,-7.1428571428571425E-2,{"$f":"IF(G5=\"\",\"\",(M5-H5)/M5)","v":-7.1428571428571425E-2},{"$f":"IF(I5=0,\"\",(L5-I5)/L5)","v":""},4500,null,{"$f":"'Simplified P&L'!$B$55","v":50},null,{"$f":"'Simplified P&L'!$B$58","v":50},null,{"$f":"'Simplified P&L'!$B$59","v":65},null,{"$f":"'Simplified P&L'!$B$60","v":40}]
[1,"EQUIPMENT","MECA","BASE","Fume hood modification with using of fixed paned and move of connection",null,1,3000,0,3000,5700,null,5700,5700,2700,0.47368421052631576,0.47368421052631576,"",3000,null,{"$f":"'Simplified P&L'!$B$55","v":50},null,{"$f":"'Simplified P&L'!$B$58","v":50},null,{"$f":"'Simplified P&L'!$B$59","v":65},null,{"$f":"'Simplified P&L'!$B$60","v":40}]
[1,"EQUIPMENT","MECA","BASE","Stelle a moisture sensor; position must be defined by Saint Gobain.",null,1,3000,0,3000,4750,null,4750,4750,1750,0.36842105263157893,0.36842105263157893,"",3000,null,{"$f":"'Simplified P&L'!$B$55","v":50},null,{"$f":"'Simplified P&L'!$B$58","v":50},null,{"$f":"'Simplified P&L'!$B$59","v":65},null,{"$f":"'Simplified P&L'!$B$60","v":40}]
[1,"EQUIPMENT","MECA","BASE","Clipped cloth instead of a welted one",null,1,1000,0,1000,1900,null,1900,1900,900,0.47368421052631576,0.47368421052631576,"",1000,null,{"$f":"'Simplified P&L'!$B$55","v":50},null,{"$f":"'Simplified P&L'!$B$58","v":50},null,{"$f":"'Simplified P&L'!$B$59","v":65},null,{"$f":"'Simplified P&L'!$B$60","v":40}]
{"$rows_left_out":28}
{"sheet":"Budget Target","index":4,"n_rows":50,"n_cols":12,"rows_kept":50,"cut":false,"hidden":false,"merged":[]}
["BUDGET TARGET HF"]
[]
[]
[null,"RUBRIQUE ANALYTIQUE","DAS","Margin Rate Target 2023"]
[null,"EQUIPMENT","DOSING",0.46500000000000002,"01/01/2024 -update dans P&L le 19/03/2024"]
[null,"EQUIPMENT","FILTRATION",0.37]
[null,"EQUIPMENT","MIXING",0.27]
[null,"EQUIPMENT","PROCESSING",0.5]
{"$rows_left_out":43}
{"sheet":"Service Calculation","index":5,"n_rows":53,"n_cols":20,"rows_kept":53,"cut":false,"hidden":false,"merged":[[33,15,33,16],[34,15,34,16],[33,6,33,7],[34,6,34,7],[33,9,33,10],[34,9,34,10],[33,12,33,13],[34,12,34,13],[30,0,30,2],[31,0,31,2],[2,6,2,10],[2,12,2,16],[3,6,3,7],[3,9,3,10],[3,12,3,13],[3,15,3,16]]}
["Only blue cell should be modified ",null,null,null,null,null,"Version of 12/08/2025"]
[null,null,null,null,null,null,null,null,null,null,null,null,null,null,null,null,null,null,null,"Instruction : "]
[null,null,null,null,null,null,"FILTRATION / KNEADING",null,null,null,null,null,"DOSING / MIXING"]
[null,null,null,null,null,null,"PRICE FOR France",null,null,"PRICE FOR Worlwide",null,null,"PRICE FOR France",null,null,"PRICE FOR Worlwide"]
["Details",null,"Quantity",null,"Unit price",null,"Unit price ","Total price ",null,"Unit price ","Total price ",null,"Unit price ","Prix total ",null,"Unit price ","Prix total ",null,null,"STEP 1 - Language"]
[null,null,null,null,null,null,"€","€",null,"€","€",null,"€","€",null,"€","€",null,null,"On sheet \"Configuration\" , cell B2 : Choose de correct language for your offer "]
["Working day  [Monday to Friday - 8h/day]",null,5,null,null,null,1017,{"$f":"G7*C7","v":5085},null,1222,{"$f":"C7*J7","v":6110},null,1152,{"$f":"C7*M7","v":5760},null,1352,{"$f":"C7*P7","v":6760}]
["Saturday working [8h/day]",null,1,null,null,null,1525,{"$f":"G8*C8","v":1525},null,1830,{"$f":"C8*J8","v":1830},null,1730,{"$f":"C8*M8","v":1730},null,2030,{"$f":"C8*P8","v":2030}]
{"$rows_left_out":46}
{"sheet":"Calculation of commissions","index":6,"n_rows":52,"n_cols":5,"rows_kept":52,"cut":false,"hidden":false,"merged":[[19,0,19,1],[0,3,0,4],[1,0,1,4],[2,1,2,3],[3,1,3,3],[4,1,4,3],[6,1,6,2],[7,2,7,3],[15,0,15,1],[16,0,16,1],[17,0,17,1],[18,0,18,1],[50,3,51,3],[50,4,51,4],[20,0,20,1],[21,0,21,1],[22,0,22,1],[23,0,23,1],[24,0,24,1],[50,0,51,0]]}
[null,null,null,"PROJECT SPECIFICATION"]
["CALCULATION OF COMMISSIONS"]
["LEGENDS:","Colour to be filled in by ASM or SPASM"]
[null,"Colour to be filled in by ADV"]
[null,"Colour to be filled in by Accounting"]
[]
["Customer :",{"$f":"'Simplified P&L'!B6","v":"St Gobain"},null,"Country: ",{"$f":"'Simplified P&L'!B10","v":"Spain"}]
["Offer number :",{"$f":"'Simplified P&L'!B2","v":"725116"},"Total of order, EXW, unpacked in € :",null,{"$f":"IF('Simplified P&L'!B3>0,IF('Simplified P&L'!G22=\"\",0,'Simplified P&L'!G22)+IF('Simplified P&L'!G23=\"\",0,'Simplified P&L'!G23)+IF('Simplified P&L'!G24=\"\",0,'Simplified P&L'!G24),IF('Simplified P&L'!D22=\"\",0,'Simplified P&L'!D22)+IF('Simplified P&L'!D23=\"\",0,'Simplified P&L'!D23)+IF('Simplified P&L'!D24=\"\",0,'Simplified P&L'!D24))","v":427780}]
{"$rows_left_out":45}
{"sheet":"Configuration","index":7,"n_rows":115,"n_cols":38,"rows_kept":115,"cut":false,"hidden":false,"merged":[]}
[]
["Offer language","English",null,null,null,null,null,null,null,null,null,null,null,null,null,"LISTES DEROULANTES",null,null,"T eng.",null,null,null,null,"ASM",null,null,null,null,"Market",null,null,null,null,"DAS","English","French","Chinese"]
[null,null,null,null,null,null,null,null,null,null,null,null,null,null,null,null,null,null,"ABOU","Tender engineer","Ahssen Boudeheb","a.boudeheb@hasler.group",null,"ABNA","Business Developer Service & Spare","Alain Bernard Nankam","ab.nankam@hasler.group","+33 6 50 40 92 77","CCH - A2 Cement",null,null,null,null,"DOSING","Dosing system","Solution de dosage"]
["Budget proposal","No",null,null,null,null,null,null,null,null,null,null,null,null,null,"DAS","TAC",null,"AGIB","Tender engineer","Alexis Gilbert","a.gilbert@hasler.group","+33 6 13 76 81 49","AHOU","Business Development Manager","Adrien Hourlier","a.hourlier@hasler.group","+33 6 70 76 33 14","CCH - E4 Technical Silica (and Bulk)",null,null,null,null,"FILTRATION","Filtration system","Solution de filtration"]
[null,null,null,null,null,null,null,null,null,null,null,null,null,null,null,"DOSING","EQUIPMENT",null,"ANGO","Tender engineer","Ahou N'gotta","ac.n'gotta@hasler.group","+33 4 74 16 11 27","BROU","Area Technical Sales Manager","Benoît Roudaut","b.roudaut@hasler.group",{"$f":"W7","v":"+1 514-946-6350"},"CCH - F5 Cement and kiln dust dosing",null,null,null,null,"MIXING","Mixing system","Solution d'agitation "]
["Customer reference",null,null,null,null,null,null,null,null,null,null,null,null,null,null,"FILTRATION ","REVAMPING",null,"BJOL","Filtration Product Manager","Baptiste Joly","b.joly@hasler.group","+33 6 27 13 81 47","CPIS","Area Sales Manager","Cosimo Piscopiello","c.piscopiello@hasler.group","+41 79 129 42 69","CCH - H4 Soda Ash",null,null,null,null,"KNEADING","Kneading system","Solution de malaxage "]
[null,null,null,null,null,null,null,null,null,null,null,null,null,null,null,"MIXING","SPARE PARTS",null,"BROU","Area Technical Sales Manager","Benoît Roudaut","b.roudaut@hasler.group","+1 514-946-6350","DCRI","Area Sales Manager","Daniel Criado","d.criado@hasler.group","+41 79 968 12 70","CCH - other",null,null,null,null,null,"Commercial offer","Offre commerciale"]
[null,null,null,null,null,null,null,null,null,null,null,null,null,null,null,"PROCESSING","SERVICE",null,"CCHA","Tender engineer","Chenghao Chai","c.chai@hasler.group","+33 4 74 16 11 53","EGUA","Process Engineer","Enrico Gualdi","e.gualdi@hasler.group",{"$f":"W9","v":"+39 345 825 82 80"},"MMF - A1 Phosphoric Acid",null,null,null,null,null,"Customer reference","Référence client"]
{"$rows_left_out":108}
{"sheet":"Main cover UK","index":8,"n_rows":55,"n_cols":38,"rows_kept":55,"cut":false,"hidden":false,"merged":[[57,8,57,9],[3,1,3,7],[4,0,4,8],[8,1,8,2],[0,19,1,44],[2,19,2,27],[2,28,2,36],[2,37,2,44],[45,4,45,5],[46,4,46,5],[47,4,47,5],[48,4,48,5],[41,6,41,8],[40,6,40,8],[41,2,41,3],[8,4,8,7],[6,4,6,7],[37,0,37,8],[39,6,39,8],[39,2,39,3],[12,4,12,7],[10,4,10,7],[50,1,50,7],[51,1,51,7],[52,1,52,7],[40,2,40,3],[47,1,47,3],[47,6,47,7],[48,1,48,3],[48,6,48,7],[45,6,45,7],[45,1,45,3],[43,0,43,8],[46,6,46,7],[46,1,46,3]]}
[null,null,null,null,null,null,null,null,null,null,null,null,null,null,null,null,null,null,null,"FILTRATION"]
[]
[null,null,null,null,null,null,null,null,null,null,null,null,null,null,null,null,null,null,null,"FAB",null,null,null,null,null,null,null,null,"ATF",null,null,null,null,null,null,null,null,"FR"]
[null,{"$f":"VLOOKUP('Simplified P&L'!G2,Configuration!AH3:AJ6,2)","v":"Filtration system"}]
["Horizontal Vacuum Belt Filter Philippe"]
[]
[null,{"$f":"\"Sales Offer N°\"","v":"Sales Offer N°"},null,null,{"$f":"'Simplified P&L'!B2 & \" - rev\" & 'Simplified P&L'!B3","v":"725116 - rev7"}]
[]
{"$rows_left_out":48}
{"sheet":"Main cover FR","index":9,"n_rows":56,"n_cols":38,"rows_kept":56,"cut":false,"hidden":true,"merged":[[36,0,36,7],[14,4,14,7],[8,1,8,2],[8,4,8,7],[10,4,10,7],[12,4,12,7],[0,19,1,44],[2,19,2,27],[2,28,2,36],[2,37,2,44],[6,4,6,7],[4,0,4,7],[3,0,3,7],[46,1,46,3],[46,6,46,7],[38,2,38,3],[39,2,39,3],[40,2,40,3],[46,4,46,5],[41,2,41,3],[42,2,42,3],[44,0,44,7],[38,6,38,7],[42,6,42,7],[41,6,41,7],[40,6,40,7],[39,6,39,7],[51,1,51,7],[52,1,52,7],[53,1,53,7],[58,8,58,9],[47,1,47,3],[47,6,47,7],[48,1,48,3],[48,6,48,7],[49,1,49,3],[49,6,49,7],[49,4,49,5],[48,4,48,5],[47,4,47,5]]}
[null,null,null,null,null,null,null,null,null,null,null,null,null,null,null,null,null,null,null,"FILTRATION"]
[]
[null,null,null,null,null,null,null,null,null,null,null,null,null,null,null,null,null,null,null,"FAB",null,null,null,null,null,null,null,null,"ATF",null,null,null,null,null,null,null,null,"FR"]
[{"$f":"VLOOKUP('Simplified P&L'!G2,Configuration!AH3:AJ6,3)","v":"Solution de filtration"}]
[]
[]
[null,"Offre Commerciale N°",null,null,{"$f":"'Simplified P&L'!B2","v":"725116"}]
[]
{"$rows_left_out":49}
{"sheet":"cover_L","index":10,"n_rows":62,"n_cols":33,"rows_kept":62,"cut":false,"hidden":false,"merged":[[24,2,24,24],[17,2,17,24]]}
[]
[null,null,null,"TABLE OF CONTENTS"]
[]
[]
[]
[null,null,null,null,{"$f":"IF(Configuration!B2=\"Français\",Configuration!AJ11,Configuration!AI11)","v":"Cover Letter"}]
[null,null,null,null,{"$f":"IF(Configuration!B2=\"Français\",Configuration!AJ12,Configuration!AI12)","v":"Price List"}]
[null,null,null,null,{"$f":"IF(Configuration!B2=\"Français\",Configuration!AJ13,Configuration!AI13)","v":"Special Terms of Sales"}]
{"$rows_left_out":55}
{"sheet":"PRICE_LIST","index":11,"n_rows":67,"n_cols":23,"rows_kept":67,"cut":false,"hidden":false,"merged":[[25,1,25,2],[25,3,25,12],[25,13,25,16],[24,1,24,2],[24,3,24,12],[24,13,24,16],[10,3,10,4],[10,5,10,8],[10,9,10,12],[10,13,10,16],[8,3,8,4],[8,5,8,8],[8,9,8,12],[8,13,8,16],[9,3,9,4],[9,5,9,8],[9,9,9,12],[9,13,9,16],[4,1,4,12],[5,9,5,12],[5,3,5,4],[5,5,5,8],[4,13,4,16],[5,13,5,16],[39,1,39,2],[39,3,39,12],[39,13,39,16],[42,26,46,35],[38,1,38,16],[6,3,6,4],[6,5,6,8],[6,9,6,12],[6,13,6,16],[7,3,7,4],[7,5,7,8],[7,9,7,12],[7,13,7,16],[11,3,11,4],[11,5,11,8],[11,9,11,12],[11,13,11,16],[12,3,12,4],[12,5,12,8],[12,9,12,12],[12,13,12,16],[13,3,13,4],[13,5,13,8],[13,9,13,12],[13,13,13,16],[15,3,15,4],[15,5,15,8],[15,9,15,12],[15,13,15,16],[14,3,14,4],[14,5,14,8],[14,9,14,12],[14,13,14,16],[16,3,16,4],[16,5,16,8],[16,9,16,12],[16,13,16,16],[17,3,17,4],[17,5,17,8],[17,9,17,12],[17,13,17,16],[23,13,23,16],[20,3,20,8],[20,9,20,12],[22,1,22,12],[22,13,22,16],[23,1,23,2],[23,3,23,12],[26,1,26,2],[26,3,26,12],[26,13,26,16],[28,1,28,16],[29,1,29,16],[31,1,31,16],[32,1,32,8],[32,9,32,12],[32,13,32,16],[33,1,33,8],[33,9,33,12],[33,13,33,16],[36,1,36,8],[36,9,36,12],[36,13,36,16],[37,1,37,8],[37,9,37,12],[37,13,37,16]]}
[]
[]
[null,{"$f":"CONCATENATE(IF(Configuration!B2=\"Français\",Configuration!AJ12,Configuration!AI12),\" - \",IF(Configuration!B2=\"Français\",Configuration!AJ26,Configuration!AI26),\" n° \",'Simplified P&L'!B2,\"-\",'Simplified P&L'!B3)","v":"Price List - Offer n° 725116-7"}]
[]
[null,{"$f":"IF(Configuration!B2=\"Français\",\"Offre de prix Equipement\",\"Equipment Price List\")","v":"Equipment Price List"},null,null,null,null,null,null,null,null,null,null,null,"OPTIONS"]
[null,"Item","Reference",{"$f":"IF(Configuration!B2=\"Français\",\"Qté\",\"Qty\")","v":"Qty"},null,{"$f":"IF(Configuration!B2=\"Français\",\"Prix de vente unitaire (€ HT)\",\"Unit Sale Price (€ ex VAT)\")","v":"Unit Sale Price (€ ex VAT)"},null,null,null,{"$f":"IF(Configuration!B2=\"Français\",\"Prix de vente total (€ HT)\",\"Total Sale Price (€ ex VAT)\")","v":"Total Sale Price (€ ex VAT)"},null,null,null,{"$f":"J6","v":"Total Sale Price (€ ex VAT)"}]
[null,"Engineering study",null,1,null,{"$f":"ROUND(IF(B7=0,0,IF('Simplified P&L'!$B$3=0,'Budget Price 1st quotation'!K3+('Budget Price 1st quotation'!L3/'Budget Price 1st quotation'!G3),'Budget Price Final order'!K3+('Budget Price Final order'!L3/'Budget Price Final order'!G3))),0)","v":196540},null,null,null,{"$f":"F7*D7","v":196540}]
[null,"Horizontal Vacuum Belt Filter 6B10 (6m²)",null,1,null,{"$f":"ROUND(IF(B8=0,0,IF('Simplified P&L'!$B$3=0,'Budget Price 1st quotation'!K4+('Budget Price 1st quotation'!L4/'Budget Price 1st quotation'!G4),'Budget Price Final order'!K4+('Budget Price Final order'!L4/'Budget Price Final order'!G4))),0)","v":196540},null,null,null,196540]
{"$rows_left_out":60}
{"sheet":"Feuil1","index":12,"n_rows":0,"n_cols":0,"rows_kept":0,"cut":false,"hidden":true,"merged":[]}

{"sheet":"STS","index":13,"n_rows":77,"n_cols":23,"rows_kept":77,"cut":false,"hidden":false,"merged":[[25,1,25,3],[25,4,25,8],[25,9,25,16],[25,17,25,21],[25,22,25,26],[24,1,24,3],[24,4,24,8],[24,9,24,16],[24,17,24,21],[24,22,24,26],[22,9,22,16],[22,17,22,21],[22,22,22,26],[23,22,23,26],[23,1,23,3],[23,4,23,8],[23,9,23,16],[23,17,23,21],[6,1,7,26],[8,1,9,26],[10,1,14,26],[69,11,69,16],[69,17,69,26],[55,5,55,10],[55,11,55,16],[55,17,55,26],[27,1,29,26],[56,1,56,4],[56,5,56,10],[56,11,56,16],[56,17,56,26],[36,1,36,28],[22,1,22,3],[22,4,22,8],[34,1,34,28],[40,1,40,28],[57,1,57,4],[57,5,57,10],[57,11,57,16],[57,17,57,26],[55,1,55,4],[68,1,68,4],[75,1,75,30],[71,1,71,4],[71,5,71,10],[71,11,71,16],[71,17,71,26],[70,1,70,4],[70,5,70,10],[70,11,70,16],[70,17,70,26],[68,5,68,10],[68,11,68,16],[68,17,68,26],[69,1,69,4],[69,5,69,10]]}
[]
[]
[null,{"$f":"IF(Configuration!B2=\"Français\",CONCATENATE(Configuration!AJ13,\" - \",Configuration!AJ26,\" n° \",'Simplified P&L'!B2),CONCATENATE(Configuration!AI13,\" - \",Configuration!AI26,\" N° \",'Simplified P&L'!B2,\"-\",'Simplified P&L'!B3))","v":"Special Terms of Sales - Offer N° 725116-7"}]
[]
[null,{"$f":"cover_L!F9","v":"Delivery Time"}]
[]
[null,"Delivery times are referenced to the deadline of the latest schedule provided by Hasler Group and accepted by you."]
[]
{"$rows_left_out":70}
{"sheet":"Customer_services","index":14,"n_rows":44,"n_cols":23,"rows_kept":44,"cut":false,"hidden":false,"merged":[[25,4,25,6],[24,4,24,6],[42,2,42,6],[43,2,43,6],[23,4,23,6],[26,4,26,6],[32,2,32,3],[32,4,32,6],[33,2,33,3],[33,4,33,6],[35,2,35,6],[41,2,41,6],[37,2,37,6],[38,2,38,6],[23,2,28,2],[27,4,27,6],[28,4,28,6],[40,2,40,6],[39,2,39,6],[36,2,36,5],[29,2,29,3],[29,4,29,6],[30,2,30,3],[30,4,30,6],[4,2,5,6],[6,2,7,6],[18,2,18,3],[19,2,19,3],[20,2,20,3],[9,2,9,3],[10,2,10,3],[11,2,14,2],[15,2,17,2]]}
[]
[]
[]
[]
[null,null,"HASLER CARE SERVICES"]
[]
[null,null,"Price list 2025 - Worldwide"]
[]
{"$rows_left_out":37}
{"sheet":"Services_client","index":15,"n_rows":42,"n_cols":7,"rows_kept":42,"cut":false,"hidden":true,"merged":[[41,2,41,6],[23,4,23,6],[30,2,30,3],[30,4,30,6],[24,4,24,6],[4,2,5,6],[6,2,7,6],[9,2,9,3],[10,2,10,3],[11,2,14,2],[15,2,17,2],[18,2,18,3],[19,2,19,3],[37,2,37,6],[23,2,26,2],[20,2,20,3],[36,2,36,6],[44,2,44,6],[45,2,45,6],[33,2,33,6],[31,4,31,6],[25,4,25,6],[26,4,26,6],[28,2,28,3],[28,4,28,6],[31,2,31,3],[34,2,34,6],[35,2,35,6],[40,2,40,6],[27,2,27,3],[27,4,27,6],[38,2,38,6],[39,2,39,6]]}
[]
[]
[]
[]
[null,null,"HASLER CARE SERVICES"]
[]
[null,null,"Tarif 2025 - France"]
[]
{"$rows_left_out":35}
{"sheet":"GTC","index":16,"n_rows":199,"n_cols":23,"rows_kept":199,"cut":false,"hidden":false,"merged":[[163,1,195,31],[131,1,160,31],[94,1,128,31],[59,1,91,31],[198,1,232,31]]}
[]
[]
[null,null,"ABOUT HASLER Group"]
[]
[]
[]
[]
[]
{"$rows_left_out":192}
{"sheet":"CGV","index":17,"n_rows":221,"n_cols":3,"rows_kept":221,"cut":false,"hidden":true,"merged":[[256,1,259,30],[59,1,93,30],[182,1,217,30],[139,1,178,30],[97,1,136,30],[220,1,255,30]]}
[]
[]
[null,null,"A PROPOS D'HASLER Group"]
[]
[]
[]
[]
[]
{"$rows_left_out":214}
{"sheet":"Agents","index":18,"n_rows":65,"n_cols":2,"rows_kept":65,"cut":false,"hidden":false,"merged":[]}
["Nom","Code Representant"]
[]
["ADRIAN SCALE - 102120","A7"]
["AL BIJJAR - 102187","C1"]
["ALGHANEM TRAD. & CONTR. CO. LTD.-101895","85"]
["ALPHA EGYPT - 101941","76"]
["AMIDAS SECURITEC - 102179","B7"]
["AMMERMANN - 101994","C5"]
{"$rows_left_out":57}