{"text_format":"1","workbook":"xlsx","n_sheets":18,"sheets":["Rules","Simplified P&L","Budget Price 1st quotation","Budget Price Final order","Synthèse chiffrage","Budget Target","Configuration","Main cover","cover_L","PRICE_LIST","Feuil1","Quotation","Quotation2","Quotation3","STS","Customer_services","Services_client","GTC"],"not_rendered":{"charts":0,"images":32,"macros":1,"external_links":10,"defined_names":293,"comments":2,"pivot_tables":0},"unopened":[],"bounds":{"document_bytes":16777216,"sheet_cells":100000,"rows_first":2000,"rows_last":500,"rows_between":2000,"halvings":0,"cell_chars":16384,"cell_head_chars":4096},"cells_cut":0,"cells_raw":0,"read":"whole","date_system":"1900"}

{"sheet":"Rules","index":0,"n_rows":51,"n_cols":9,"rows_kept":51,"cut":false,"hidden":false,"merged":[]}
["RULES "]
[]
[]
[null,"In budget price:"]
[null,null,"All white boxes : to be filled by AE. Must be representative of the offer display"]
[null,null,null,"Each line for EQ can include (or not) sold engineering studies (columns S to Z)"]
[null,null,null,"Only specific design related studies must be sold -> to be decided in Feasability review"]
[null,null,null,"Indicate a note on the EQ Unit Cost price if a big part was estimated: example : 50% from previous order MS0450, 25% estimated, 25% consulted "]
{"$rows_left_out":44}
{"sheet":"Simplified P&L","index":1,"n_rows":84,"n_cols":11,"rows_kept":84,"cut":false,"hidden":false,"merged":[[26,1,26,2],[7,1,7,2],[21,1,21,2],[8,3,11,10],[0,1,0,10],[4,6,6,10],[7,3,7,10],[17,0,18,2],[17,3,18,3],[17,6,18,6],[17,9,18,9],[17,10,18,10]]}
[null,"Simplified P&L"]
["Quotation :",731693,null,"DAS:",null,null,"FILTRATION","ASM:",null,"LLi"]
["Commercial offer version:",2,null,"TAC:",null,null,"EQUIPMENT","T eng. :",null,"BJOL"]
["Technical offer version:",4,null,"Incoterm",null,null,"FCA - SHANGHAI - CHN","CEGID Order:"]
[null,null,null,null,null,null,"40 weeks on EXW HASLER China workshop basis."]
["Customer :","Eurochem",null,"Lead time :"]
[]
["Market:","MMF - B1 Phosphated Fertilizers (MAP,DAP,TSP,DCP …)",null,"Project description / comments: "]
{"$rows_left_out":77}
{"sheet":"Budget Price 1st quotation","index":2,"n_rows":43,"n_cols":27,"rows_kept":43,"cut":false,"hidden":false,"merged":[[0,19,0,26]]}
[null,null,null,null,null,null,null,null,null,null,null,null,null,null,null,null,null,null,null,"DIRECT HOURS SOLD"]
["Position","Type of Eqpt","Meca/Elec","Base / Options","DESCRIPTION","RÉFÉRENCE","QTY","TOTAL EQ Cost","TOTAL Hours cost","TOTAL Cost","EQ Unit selling price","Total Hours Selling Price","TOTAL EQ Selling Price","TOTAL Selling Price","Gross Margin on Direct External Costs","Gross Margin on Direct External Costs","Margin on EQ","Margin on hours","EQ Unit Cost ","Nb hours TECH","Hours Unit Cost","Nb hours PUR","Hours Unit Cost","Nb hours PM","Hours Unit Cost","Nb hours WORKSHOP","Hours Unit Cost"]
[1,null,null,"BASE",null,null,null,{"$f":"+S3*G3","v":0},{"$f":"T3*U3+V3*W3+X3*Y3+Z3*AA3","v":0},{"$f":"I3+H3","v":0},null,null,{"$f":"G3*K3","v":0},{"$f":"M3+L3","v":0},{"$f":"+N3-H3","v":0},{"$f":"IF(G3=\"\",\"\",+O3/N3)","v":""},{"$f":"IF(G3=\"\",\"\",(M3-H3)/M3)","v":""},{"$f":"IF(I3=0,\"\",(L3-I3)/L3)","v":""},null,null,{"$f":"'Simplified P&L'!$B$55","v":50},null,{"$f":"'Simplified P&L'!$B$58","v":50},null,{"$f":"'Simplified P&L'!$B$59","v":65},null,{"$f":"'Simplified P&L'!$B$60","v":40}]
[0,null,null,"BASE",null,null,null,{"$f":"+S4*G4","v":0},{"$f":"T4*U4+V4*W4+X4*Y4+Z4*AA4","v":0},{"$f":"I4+H4","v":0},null,null,{"$f":"G4*K4","v":0},{"$f":"M4+L4","v":0},{"$f":"+N4-H4","v":0},{"$f":"IF(G4=\"\",\"\",+O4/N4)","v":""},{"$f":"IF(G4=\"\",\"\",(M4-H4)/M4)","v":""},{"$f":"IF(I4=0,\"\",(L4-I4)/L4)","v":""},null,null,{"$f":"'Simplified P&L'!$B$55","v":50},null,{"$f":"'Simplified P&L'!$B$58","v":50},null,{"$f":"'Simplified P&L'!$B$59","v":65},null,{"$f":"'Simplified P&L'!$B$60","v":40}]
[0,null,null,"BASE",null,null,null,0,0,0,null,null,0,0,0,"",{"$f":"IF(G5=\"\",\"\",(M5-H5)/M5)","v":""},{"$f":"IF(I5=0,\"\",(L5-I5)/L5)","v":""},null,null,{"$f":"'Simplified P&L'!$B$55","v":50},null,{"$f":"'Simplified P&L'!$B$58","v":50},null,{"$f":"'Simplified P&L'!$B$59","v":65},null,{"$f":"'Simplified P&L'!$B$60","v":40}]
[0,null,null,"BASE",null,null,null,{"$f":"+S6*G6","v":0},{"$f":"T6*U6+V6*W6+X6*Y6+Z6*AA6","v":0},{"$f":"I6+H6","v":0},null,null,{"$f":"G6*K6","v":0},{"$f":"M6+L6","v":0},{"$f":"+N6-H6","v":0},{"$f":"IF(G6=\"\",\"\",+O6/N6)","v":""},{"$f":"IF(G6=\"\",\"\",(M6-H6)/M6)","v":""},{"$f":"IF(I6=0,\"\",(L6-I6)/L6)","v":""},null,null,{"$f":"'Simplified P&L'!$B$55","v":50},null,{"$f":"'Simplified P&L'!$B$58","v":50},null,{"$f":"'Simplified P&L'!$B$59","v":65},null,{"$f":"'Simplified P&L'!$B$60","v":40}]
[0,null,null,"BASE",null,null,null,0,0,0,null,null,0,0,0,"","","",null,null,{"$f":"'Simplified P&L'!$B$55","v":50},null,{"$f":"'Simplified P&L'!$B$58","v":50},null,{"$f":"'Simplified P&L'!$B$59","v":65},null,{"$f":"'Simplified P&L'!$B$60","v":40}]
[0,null,null,"BASE",null,null,null,0,0,0,null,null,0,0,0,"","","",null,null,{"$f":"'Simplified P&L'!$B$55","v":50},null,{"$f":"'Simplified P&L'!$B$58","v":50},null,{"$f":"'Simplified P&L'!$B$59","v":65},null,{"$f":"'Simplified P&L'!$B$60","v":40}]
{"$rows_left_out":36}
{"sheet":"Budget Price Final order","index":3,"n_rows":45,"n_cols":27,"rows_kept":45,"cut":false,"hidden":false,"merged":[[0,19,0,26]]}
[null,null,null,null,null,null,null,null,null,null,null,null,null,null,null,null,null,null,null,"DIRECT HOURS SOLD"]
["Position","Type of Eqpt","Meca/Elec","Base / Options","DESCRIPTION","RÉFÉRENCE","QTY","TOTAL EQ Cost","TOTAL Hours cost","TOTAL Cost","EQ Unit selling price","Total Hours Selling Price","TOTAL EQ Selling Price","TOTAL Selling Price","Gross Margin on Direct External Costs","Gross Margin on Direct External Costs","Margin on EQ","Margin on hours","EQ Unit Cost ","Nb hours TECH","Hours Unit Cost","Nb hours PUR","Hours Unit Cost","Nb hours PM","Hours Unit Cost","Nb hours WORKSHOP","Hours Unit Cost"]
[0,"EQUIPMENT","MECA","BASE","Horizontal Vaccum Belt Filter 78B30 (78m²)",null,1,{"$f":"+S3*G3","v":365087},{"$f":"+(65000*H3/1001603)","v":23692.67564094756},{"$f":"I3+H3","v":388779.67564094753},{"$f":"+H3/0.62","v":588850},{"$f":"+I3/0.7","v":33846.679487067944},{"$f":"G3*K3","v":588850},{"$f":"M3+L3","v":622696.67948706797},{"$f":"+N3-H3","v":257609.67948706797},{"$f":"IF(G3=\"\",\"\",+O3/N3)","v":0.41370010146716696},{"$f":"IF(G3=\"\",\"\",(M3-H3)/M3)","v":0.38},{"$f":"IF(I3=0,\"\",(L3-I3)/L3)","v":0.30000000000000004},365087,null,{"$f":"'Simplified P&L'!$B$55","v":50},null,{"$f":"'Simplified P&L'!$B$58","v":50},null,{"$f":"'Simplified P&L'!$B$59","v":65},null,{"$f":"'Simplified P&L'!$B$60","v":40}]
[0,"EQUIPMENT","MECA","BASE","Manifold",null,1,{"$f":"+S4*G4","v":13350.37},{"$f":"+(65000*H4/1001603)","v":866.38523446914598},{"$f":"I4+H4","v":14216.755234469147},{"$f":"+H4/0.71","v":18803.338028169015},{"$f":"+I4/0.7","v":1237.6931920987799},{"$f":"G4*K4","v":18803.338028169015},{"$f":"M4+L4","v":20041.031220267796},{"$f":"+N4-H4","v":6690.6612202677952},{"$f":"IF(G4=\"\",\"\",+O4/N4)","v":0.33384815116207339},{"$f":"IF(G4=\"\",\"\",(M4-H4)/M4)","v":0.28999999999999998},{"$f":"IF(I4=0,\"\",(L4-I4)/L4)","v":0.3},13350.37,null,{"$f":"'Simplified P&L'!$B$55","v":50},null,{"$f":"'Simplified P&L'!$B$58","v":50},null,{"$f":"'Simplified P&L'!$B$59","v":65},null,{"$f":"'Simplified P&L'!$B$60","v":40}]
[0,"EQUIPMENT","MECA","BASE","Filtrate Receiver 1",null,1,28118.52,1824.7786797763185,29943.298679776319,{"$f":"+H5/0.71","v":39603.549295774654},2606.8266853947412,39603.549295774654,42210.375981169396,14091.855981169396,0.33384815116207345,{"$f":"IF(G5=\"\",\"\",(M5-H5)/M5)","v":0.29000000000000009},{"$f":"IF(I5=0,\"\",(L5-I5)/L5)","v":0.3000000000000001},28118.52,null,{"$f":"'Simplified P&L'!$B$55","v":50},null,{"$f":"'Simplified P&L'!$B$58","v":50},null,{"$f":"'Simplified P&L'!$B$59","v":65},null,{"$f":"'Simplified P&L'!$B$60","v":40}]
[0,"EQUIPMENT","MECA","BASE","Filtrate Receiver 2",null,1,28118.52,1824.7786797763185,29943.298679776319,39603.549295774654,2606.8266853947412,39603.549295774654,42210.375981169396,14091.855981169396,0.33384815116207345,0.29000000000000009,0.3000000000000001,28118.52,null,{"$f":"'Simplified P&L'!$B$55","v":50},null,{"$f":"'Simplified P&L'!$B$58","v":50},null,{"$f":"'Simplified P&L'!$B$59","v":65},null,{"$f":"'Simplified P&L'!$B$60","v":40}]
[0,"EQUIPMENT","MECA","BASE","Filtrate Receiver 3",null,1,28118.52,1824.7786797763185,29943.298679776319,39603.549295774654,2606.8266853947412,39603.549295774654,42210.375981169396,14091.855981169396,0.33384815116207345,0.29000000000000009,0.3000000000000001,28118.52,null,{"$f":"'Simplified P&L'!$B$55","v":50},null,{"$f":"'Simplified P&L'!$B$58","v":50},null,{"$f":"'Simplified P&L'!$B$59","v":65},null,{"$f":"'Simplified P&L'!$B$60","v":40}]
[0,"EQUIPMENT","MECA","BASE","Moisture trap",null,1,6010.58,390.0624299248305,6400.6424299248301,8465.6056338028175,557.23204274975785,8465.6056338028175,9022.8376765525754,3012.2576765525755,0.33384815116207339,0.29000000000000004,0.3,6010.58,null,{"$f":"'Simplified P&L'!$B$55","v":50},null,{"$f":"'Simplified P&L'!$B$58","v":50},null,{"$f":"'Simplified P&L'!$B$59","v":65},null,{"$f":"'Simplified P&L'!$B$60","v":40}]
{"$rows_left_out":38}
{"sheet":"Synthèse chiffrage","index":4,"n_rows":40,"n_cols":6,"rows_kept":40,"cut":false,"hidden":false,"merged":[[27,4,27,5],[29,5,30,5],[5,4,5,5],[7,5,8,5],[13,4,13,5],[15,5,16,5],[20,4,20,5],[22,5,23,5]]}
[]
[]
[null,"OFFRE ",{"$f":"[2]Calculations!C3&\" _rev\"&[2]Calculations!G2","v":"731693 _rev2"},"FOR INTERNAL USE ONLY",null,"2025-02-20"]
[null,"CLIENT",{"$f":"[2]Calculations!C2","v":"Eurochem"},null,null,{"$f":"'[2]Offre NEW'!M16","v":"Baptiste JOLY"}]
[]
[null,"TOTAL sans SERVICES ni PACK & TRANSP",null,"€","%"]
[null,null,"Prix revient",{"$f":"D15+D22+D29","v":1001603.8227070338}]
[null,null,"Prix consulté",{"$f":"D16+D23+D30","v":772370.17812440882},{"$f":"D8/$D$7","v":0.77113341684032777},{"$f":"E8+E9","v":0.83866880685856604}]
{"$rows_left_out":33}
{"sheet":"Budget Target","index":5,"n_rows":50,"n_cols":12,"rows_kept":50,"cut":false,"hidden":false,"merged":[]}
["BUDGET TARGET HF"]
[]
[]
[null,"RUBRIQUE ANALYTIQUE","DAS","Margin Rate Target 2023"]
[null,"EQUIPMENT","DOSING",0.46500000000000002,"01/01/2024 -update dans P&L le 19/03/2024"]
[null,"EQUIPMENT","FILTRATION",0.37]
[null,"EQUIPMENT","MIXING",0.27]
[null,"EQUIPMENT","PROCESSING",0.5]
{"$rows_left_out":43}
{"sheet":"Configuration","index":6,"n_rows":85,"n_cols":36,"rows_kept":85,"cut":false,"hidden":false,"merged":[]}
[]
["Offer language","English",null,null,null,null,null,null,null,null,null,null,null,null,null,"LISTES DEROULANTES",null,null,"T eng.",null,null,null,"ASM",null,null,null,"Market",null,null,null,null,"DAS","English","French","Chinese"]
[null,null,null,null,null,null,null,null,null,null,null,null,null,null,null,null,null,null,"ABOU","Tender engineer","Ahssen Boudeheb","a.boudeheb@hasler.group","ABNA","Business Developer Service & Spare","Alain Bernard Nankam","ab.nankam@hasler.group","CCH - A2 Cement",null,null,null,null,"DOSING","Dosing system","Solution de dosage"]
["Budget proposal","No",null,null,null,null,null,null,null,null,null,null,null,null,null,"DAS","TAC",null,"AGIB","Tender engineer","Alexis Gilbert","a.gilbert@hasler.group","AHOU","Business Development Manager","Adrien Hourlier","a.hourlier@hasler.group","CCH - E4 Technical Silica (and Bulk)",null,null,null,null,"FILTRATION","Filtration system","Solution de filtration"]
[null,null,null,null,null,null,null,null,null,null,null,null,null,null,null,"DOSING","EQUIPMENT",null,"ANGO","Tender engineer","Ahou N'gotta","ac.n'gotta@hasler.group","BROU","Area Technical Sales Manager","Benoît Roudaut","b.roudaut@hasler.group","CCH - F5 Cement and kiln dust dosing",null,null,null,null,"MIXING","Mixing system","Solution d'agitation "]
["Customer reference",null,null,null,null,null,null,null,null,null,null,null,null,null,null,"FILTRATION ","REVAMPING",null,"BJOL","Filtration Product Manager","Baptiste Joly","b.joly@hasler.group","CPIS","Area Sales Manager","Cosimo Piscopiello","c.piscopiello@hasler.group","CCH - H4 Soda Ash",null,null,null,null,"PROCESSING","Kneading system","Solution de malaxage "]
[null,null,null,null,null,null,null,null,null,null,null,null,null,null,null,"MIXING","SPARE PARTS",null,"BROU","Area Technical Sales Manager","Benoît Roudaut","b.roudaut@hasler.group","DCRI","Area Sales Manager","Daniel Criado","d.criado@hasler.group","CCH - other",null,null,null,null,null,"Commercial offer","Offre commerciale"]
[null,null,null,null,null,null,null,null,null,null,null,null,null,null,null,"PROCESSING","SERVICE",null,"CCHA","Tender engineer","Chenghao Chai","c.chai@hasler.group","EGUA","Process Engineer","Enrico Gualdi","e.gualdi@hasler.group","MMF - A1 Phosphoric Acid",null,null,null,null,null,"Customer reference","Référence client"]
{"$rows_left_out":78}
{"sheet":"Main cover","index":7,"n_rows":38,"n_cols":10,"rows_kept":38,"cut":false,"hidden":false,"merged":[[37,8,37,9],[14,2,14,8]]}
[]
[]
[]
[]
[]
[]
[]
[]
{"$rows_left_out":31}
{"sheet":"cover_L","index":8,"n_rows":70,"n_cols":25,"rows_kept":70,"cut":false,"hidden":false,"merged":[[23,2,23,24],[25,2,25,24]]}
[]
[]
[]
[]
[]
[null,{"$f":"IF(Configuration!B2=\"Français\",Configuration!AH10,Configuration!AG10)","v":"Table of Contents"}]
[]
[null,null,{"$f":"IF(Configuration!B2=\"Français\",Configuration!AH11,Configuration!AG11)","v":"Cover Letter"}]
{"$rows_left_out":63}
{"sheet":"PRICE_LIST","index":9,"n_rows":60,"n_cols":14,"rows_kept":60,"cut":false,"hidden":true,"merged":[[29,1,29,2],[29,3,29,8],[29,9,29,12],[29,13,29,16],[30,1,30,2],[30,3,30,8],[30,9,30,12],[30,13,30,16],[27,1,27,2],[27,3,27,8],[27,9,27,12],[27,13,27,16],[28,1,28,2],[28,3,28,8],[28,9,28,12],[28,13,28,16],[22,1,22,2],[22,3,22,12],[22,13,22,16],[25,1,25,16],[26,1,26,2],[26,3,26,8],[26,9,26,12],[26,13,26,16],[16,3,16,4],[16,5,16,8],[16,9,16,12],[16,13,16,16],[21,13,21,16],[18,3,18,8],[18,9,18,12],[20,1,20,12],[20,13,20,16],[21,1,21,2],[21,3,21,12],[13,3,13,4],[13,5,13,8],[13,9,13,12],[13,13,13,16],[14,3,14,4],[14,5,14,8],[14,9,14,12],[14,13,14,16],[6,3,6,4],[6,5,6,8],[6,9,6,12],[6,13,6,16],[4,1,4,12],[5,9,5,12],[5,3,5,4],[5,5,5,8],[4,13,4,16],[5,13,5,16],[32,1,32,2],[32,3,32,12],[32,13,32,16],[35,26,39,35],[31,1,31,16],[7,3,7,4],[7,5,7,8],[7,9,7,12],[7,13,7,16],[8,3,8,4],[8,5,8,8],[8,9,8,12],[8,13,8,16],[10,3,10,4],[10,5,10,8],[10,9,10,12],[10,13,10,16],[12,3,12,4],[12,5,12,8],[12,9,12,12],[12,13,12,16]]}
[]
[]
[null,{"$f":"CONCATENATE(IF(Configuration!B2=\"Français\",Configuration!AH12,Configuration!AG12),\" - \",IF(Configuration!B2=\"Français\",Configuration!AH26,Configuration!AG26),\" n° \",'Simplified P&L'!B2,\"-\",'Simplified P&L'!B3)","v":"Price List - Offer n° 731693-2"}]
[]
[null,{"$f":"IF(Configuration!B2=\"Français\",\"Offre de prix Equipement\",\"Equipment Price List\")","v":"Equipment Price List"},null,null,null,null,null,null,null,null,null,null,null,"OPTIONS"]
[null,"Item","Reference",{"$f":"IF(Configuration!B2=\"Français\",\"Qté\",\"Qty\")","v":"Qty"},null,{"$f":"IF(Configuration!B2=\"Français\",\"Prix de vente unitaire (€ HT)\",\"Unit Sale Price (€ ex VAT)\")","v":"Unit Sale Price (€ ex VAT)"},null,null,null,{"$f":"IF(Configuration!B2=\"Français\",\"Prix de vente total (€ HT)\",\"Total Sale Price (€ ex VAT)\")","v":"Total Sale Price (€ ex VAT)"},null,null,null,{"$f":"J6","v":"Total Sale Price (€ ex VAT)"}]
[null,"          GRAVIT LIMESTONE ","GRAVIT",1,null,{"$f":"ROUND(IF(B7=0,0,IF('Simplified P&L'!$B$3=0,'Budget Price 1st quotation'!K3+('Budget Price 1st quotation'!L3/'Budget Price 1st quotation'!G3),'Budget Price Final order'!K3+('Budget Price Final order'!L3/'Budget Price Final order'!G3))),0)","v":622697},null,null,null,{"$f":"F7*D7","v":622697}]
[null,"          Rod closing gate","Rod closing Gate ",1,null,{"$f":"ROUND(IF(B8=0,0,IF('Simplified P&L'!$B$3=0,'Budget Price 1st quotation'!K5+('Budget Price 1st quotation'!L5/'Budget Price 1st quotation'!G5),'Budget Price Final order'!K5+('Budget Price Final order'!L5/'Budget Price Final order'!G5))),0)","v":42210},null,null,null,{"$f":"F8*D8","v":42210}]
{"$rows_left_out":53}
{"sheet":"Feuil1","index":10,"n_rows":0,"n_cols":0,"rows_kept":0,"cut":false,"hidden":true,"merged":[]}

{"sheet":"Quotation","index":11,"n_rows":77,"n_cols":18,"rows_kept":77,"cut":false,"hidden":false,"merged":[[73,1,74,7],[73,8,74,9],[75,1,75,7],[75,8,75,9],[76,1,76,2],[76,3,76,7],[76,8,76,9],[67,8,69,9],[15,3,15,6],[16,3,16,6],[17,3,17,6],[18,3,18,6],[19,3,19,6],[20,3,20,6],[21,3,21,6],[22,3,22,6],[23,3,23,6],[24,3,24,6],[67,1,69,7],[7,1,24,1],[14,3,14,6],[3,2,3,9],[6,3,6,4],[6,5,6,6],[6,8,6,9],[7,3,7,4],[7,5,7,6],[7,7,24,7],[7,8,66,9],[8,2,8,6],[9,3,9,6],[10,3,10,6],[11,3,11,6],[12,3,12,6],[13,3,13,6]]}
[null,null,null,null,null,null,null,null,null,null,null,null,null,null,null,null,"FR",1]
[null,null,null,null,null,null,null,null,null,null,null,null,null,null,null,null,"GB",2]
[]
[null,null,{"$f":"[2]cover_L!C7&\" \"&IF('[2]Offre NEW'!C3=\"FR\",\"- Offre N° \",\"- Offer N° \")&'[2]récap interne pour DIRECTION'!B6","v":"Price List - Offer N° 731693_01rev2"}]
[]
[]
[null,null,{"$f":"IF('[2]Offre NEW'!C3=\"FR\",\"Filtre\",\"Filter\")","v":"Filter"},{"$f":"IF('[2]Offre NEW'!C3=\"FR\",\"Taille (m²)\",\"Size (m²)\")","v":"Size (m²)"},null,{"$f":"IF('[2]Offre NEW'!C3=\"FR\",\"Largeur (m)\",\"Width (m)\")","v":"Width (m)"},null,{"$f":"IF('[2]Offre NEW'!C3=\"FR\",\"Qté\",\"Qty\")","v":"Qty"},{"$f":"IF('[2]Offre NEW'!C3=\"FR\",\"GRAND TOTAL EQUIPEMENT, € (hors taxes)\",\"GRAND TOTAL EQUIPMENT, € (excluding VAT)\")","v":"GRAND TOTAL EQUIPMENT, € (excluding VAT)"}]
[null,1,{"$f":"'[2]Offre NEW'!C7","v":"Filter"},{"$f":"[2]Calculations!$C$9","v":78},null,{"$f":"[2]Calculations!$E$9/1000","v":3},null,{"$f":"'[2]Offre NEW'!H7","v":1}]
{"$rows_left_out":70}
{"sheet":"Quotation2","index":12,"n_rows":72,"n_cols":18,"rows_kept":72,"cut":false,"hidden":false,"merged":[[3,2,3,9],[17,1,17,8],[20,2,20,9],[31,2,31,9],[32,1,32,8]]}
[null,null,null,null,null,null,null,null,null,null,null,null,null,null,null,null,"FR",1]
[null,null,null,null,null,null,null,null,null,null,null,null,null,null,null,null,"GB",2]
[]
[null,null,{"$f":"[2]cover_L!C7&\" \"&IF('[2]Offre NEW'!C3=\"FR\",\"- Offre N° \",\"- Offer N° \")&'[2]récap interne pour DIRECTION'!B6","v":"Price List - Offer N° 731693_01rev2"}]
[]
[]
[null,null,"Options",null,null,null,null,"Qty","Unit Sale Price (€ ex VAT)","Total Sale Price\n(€ ex VAT)"]
[null,"A","Cloth Ultrasonic welding machine",null,null,null,null,1,{"$f":"'Budget Price Final order'!N24","v":11500},{"$f":"H8*I8","v":11500}]
{"$rows_left_out":65}
{"sheet":"Quotation3","index":13,"n_rows":18,"n_cols":18,"rows_kept":18,"cut":false,"hidden":true,"merged":[[3,2,3,9],[16,2,16,9],[17,1,17,8]]}
[null,null,null,null,null,null,null,null,null,null,null,null,null,null,null,null,"FR",1]
[null,null,null,null,null,null,null,null,null,null,null,null,null,null,null,null,"GB",2]
[]
[null,null,{"$f":"[2]cover_L!C7&\" \"&IF('[2]Offre NEW'!C3=\"FR\",\"- Offre N° \",\"- Offer N° \")&'[2]récap interne pour DIRECTION'!B6","v":"Price List - Offer N° 731693_01rev2"}]
[]
[]
[null,null,"Spare Parts & Services",null,null,null,null,"Qty","Unit Sale Price (€ ex VAT)","Total Sale Price\n(€ ex VAT)"]
[null,"A","Erection for 6 weeks",null,null,null,null,1,{"$f":"'Budget Price Final order'!N39","v":53840},{"$f":"H8*I8","v":53840}]
{"$rows_left_out":11}
{"sheet":"STS","index":14,"n_rows":81,"n_cols":23,"rows_kept":81,"cut":false,"hidden":false,"merged":[[30,1,30,3],[30,4,30,8],[30,9,30,16],[30,17,30,21],[30,22,30,26],[29,1,29,3],[29,4,29,8],[29,9,29,16],[29,17,29,21],[29,22,29,26],[28,1,28,3],[28,4,28,8],[28,9,28,16],[28,17,28,21],[28,22,28,26],[27,1,27,3],[27,4,27,8],[27,9,27,16],[27,17,27,21],[27,22,27,26],[24,9,24,16],[24,17,24,21],[24,22,24,26],[25,22,25,26],[26,1,26,3],[26,4,26,8],[26,9,26,16],[26,17,26,21],[26,22,26,26],[25,1,25,3],[25,4,25,8],[25,9,25,16],[25,17,25,21],[6,1,7,26],[8,1,9,26],[10,1,14,26],[72,11,72,16],[72,17,72,26],[58,5,58,10],[58,11,58,16],[58,17,58,26],[32,1,34,26],[59,1,59,4],[59,5,59,10],[59,11,59,16],[59,17,59,26],[40,1,40,28],[24,1,24,3],[24,4,24,8],[79,1,79,28],[38,1,38,28],[44,1,44,28],[60,1,60,4],[60,5,60,10],[60,11,60,16],[60,17,60,26],[73,1,73,4],[73,5,73,10],[73,11,73,16],[73,17,73,26],[71,5,71,10],[71,11,71,16],[71,17,71,26],[72,1,72,4],[72,5,72,10]]}
[]
[]
[null,{"$f":"IF(Configuration!B2=\"Français\",CONCATENATE(Configuration!AH13,\" - \",Configuration!AH26,\" n° \",'Simplified P&L'!B2),CONCATENATE(Configuration!AG13,\" - \",Configuration!AG26,\" N° \",'Simplified P&L'!B2,\"-\",'Simplified P&L'!B3))","v":"Special Terms of Sales - Offer N° 731693-2"}]
[]
[null,{"$f":"cover_L!D11","v":"Delivery Time"}]
[]
[null,{"$f":"IF(Configuration!B2=\"Français\",IF(MID('Simplified P&L'!G5,2,1)=\"\",LEFT('Simplified P&L'!G5,1) & Configuration!AH50,LEFT('Simplified P&L'!G5,2) & \" \" & Configuration!AH50),'Simplified P&L'!G5)","v":"40 weeks on EXW HASLER China workshop basis."}]
[]
{"$rows_left_out":74}
{"sheet":"Customer_services","index":15,"n_rows":43,"n_cols":7,"rows_kept":43,"cut":false,"hidden":false,"merged":[[15,11,15,15],[29,12,29,15],[42,2,42,6],[43,2,43,6],[44,2,44,6],[19,2,19,3],[20,2,20,3],[21,2,21,3],[23,2,23,3],[23,4,23,6],[24,2,24,3],[24,4,24,6],[30,2,30,3],[30,4,30,6],[31,2,31,3],[31,4,31,6],[45,2,45,6],[25,2,26,2],[25,4,25,6],[26,4,26,6],[27,5,27,6],[28,2,29,2],[28,4,28,6],[29,4,29,6],[33,2,33,3],[33,4,33,6],[34,2,34,3],[34,4,34,6],[36,2,36,6],[37,2,37,5],[38,2,38,6],[39,2,39,6],[5,2,8,6],[10,2,10,3],[11,2,11,3],[12,2,15,2],[16,2,18,2]]}
[]
[]
[]
[]
[]
[null,null,"PRICE LIST 2025 - Worldwide\nCUSTOMER SERVICES"]
[]
[]
{"$rows_left_out":36}
{"sheet":"Services_client","index":16,"n_rows":45,"n_cols":7,"rows_kept":45,"cut":false,"hidden":true,"merged":[[47,2,47,6],[40,2,40,6],[41,2,41,6],[44,2,44,6],[45,2,45,6],[46,2,46,6],[25,2,26,2],[25,4,25,6],[26,4,26,6],[27,5,27,6],[28,2,31,2],[28,4,28,6],[31,4,31,6],[39,2,39,5],[32,2,32,3],[32,4,32,6],[33,2,33,3],[33,4,33,6],[35,2,35,3],[35,4,35,6],[36,2,36,3],[36,4,36,6],[38,2,38,6],[20,2,20,3],[21,2,21,3],[23,2,23,3],[23,4,23,6],[24,2,24,3],[24,4,24,6],[19,2,19,3],[5,2,8,6],[10,2,10,3],[11,2,11,3],[12,2,15,2],[16,2,18,2]]}
[null,null,null,null,"\n\nTARIF 2016 - France\nOFFRE DE SERVICES\n"]
[]
[]
[]
[]
[null,null,"TARIF 2024 - France\nOFFRE DE SERVICES"]
[]
[]
{"$rows_left_out":38}
{"sheet":"GTC","index":17,"n_rows":203,"n_cols":2,"rows_kept":203,"cut":false,"hidden":false,"merged":[[51,1,97,29],[101,1,147,29],[1,0,1,30],[152,1,194,29],[202,1,244,29]]}
[]
["DISCOVER HASLER GROUP"]
[]
[]
[]
[]
[]
[]
{"$rows_left_out":195}