{"text_format":"1","workbook":"xlsx","n_sheets":11,"sheets":["Rules","Simplified P&L","Budget Price 1st quotation","Budget Price Final order","Budget Target","Configuration","Main cover","cover_L","PRICE_LIST","STS","GTC"],"not_rendered":{"charts":0,"images":34,"macros":1,"external_links":8,"defined_names":218,"comments":3,"pivot_tables":0},"unopened":[],"bounds":{"document_bytes":16777216,"sheet_cells":100000,"rows_first":2000,"rows_last":500,"rows_between":2000,"halvings":0,"cell_chars":16384,"cell_head_chars":4096},"cells_cut":0,"cells_raw":0,"read":"whole","date_system":"1900"}

{"sheet":"Rules","index":0,"n_rows":51,"n_cols":9,"rows_kept":51,"cut":false,"hidden":false,"merged":[]}
["RULES "]
[]
[]
[null,"In budget price:"]
[null,null,"All white boxes : to be filled by AE. Must be representative of the offer display"]
[null,null,null,"Each line for EQ can include (or not) sold engineering studies (columns S to Z)"]
[null,null,null,"Only specific design related studies must be sold -> to be decided in Feasability review"]
[null,null,null,"Indicate a note on the EQ Unit Cost price if a big part was estimated: example : 50% from previous order MS0450, 25% estimated, 25% consulted "]
[]
[null,null,"All orange boxes in columns K & L: to be filled by ASM for Selling price"]
[]
[null,null,"SERVICES : lines 29 and down : AE fills the selling price, no margin applied"]
[]
[]
[]
{"$rows_left_out":37}
{"sheet":"Simplified P&L","index":1,"n_rows":84,"n_cols":11,"rows_kept":84,"cut":false,"hidden":false,"merged":[[26,1,26,2],[7,1,7,2],[21,1,21,2],[8,3,11,10],[0,1,0,10],[4,6,6,10],[7,3,7,10],[17,0,18,2],[17,3,18,3],[17,6,18,6],[17,9,18,9],[17,10,18,10]]}
[null,"Simplified P&L"]
["Quotation :",732482,null,"DAS:",null,null,"FILTRATION","ASM:",null,"LMEN"]
["Commercial offer version:","1 AMENDMENT #1",null,"TAC:",null,null,"EQUIPMENT","T eng. :",null,"ANGO"]
["Technical offer version:",1,null,"Incoterm",null,null,"DAP - Ronnskar - SWE - SUE","CEGID Order:"]
[null,null,null,null,null,null,"Upon our prior agreement"]
["Customer :","Boliden",null,"Lead time :"]
[]
["Market:","MMF - N3 Nickel, Cobalt and Manganese",null,"Project description / comments: "]
[null,null,null,"1xHVBF 6B10  for NiSO4 production"]
["Country:","SWEDEN"]
[]
["Warranty Conditions","12 months after commissioning, latest 18 months after delivery"]
[]
[null,null,null,"Instructions:",null,null,null," = automatically filled out / do not fill out"]
["% Agent Commissions",6.3E-2,null,null,null,null,null," = to be filled out"]
{"$rows_left_out":70}
{"sheet":"Budget Price 1st quotation","index":2,"n_rows":37,"n_cols":27,"rows_kept":37,"cut":false,"hidden":false,"merged":[[0,19,0,26]]}
[null,null,null,null,null,null,null,null,null,null,null,null,null,null,null,null,null,null,null,"DIRECT HOURS SOLD"]
["Position","Type of Eqpt","Meca/Elec","Base / Options","DESCRIPTION","RÉFÉRENCE","QTY","TOTAL EQ Cost","TOTAL Hours cost","TOTAL Cost","EQ Unit selling price","Total Hours Selling Price","TOTAL EQ Selling Price","TOTAL Selling Price","Gross Margin on Direct External Costs","Gross Margin on Direct External Costs","Margin on EQ","Margin on hours","EQ Unit Cost ","Nb hours TECH","Hours Unit Cost","Nb hours PUR","Hours Unit Cost","Nb hours PM","Hours Unit Cost","Nb hours WORKSHOP","Hours Unit Cost"]
[1,"EQUIPMENT","MECA","BASE","Horizontal Vaccum Belt Filter 6B10 (6m²)",null,1,{"$f":"+S3*G3","v":135447.63},{"$f":"T3*U3+V3*W3+X3*Y3+Z3*AA3","v":0},{"$f":"I3+H3","v":135447.63},{"$f":"ROUND(H3/0.58,-2)","v":233500},null,{"$f":"G3*K3","v":233500},{"$f":"M3+L3","v":233500},{"$f":"+N3-H3","v":98052.37},{"$f":"IF(G3=\"\",\"\",+O3/N3)","v":0.41992449678800853},{"$f":"IF(G3=\"\",\"\",(M3-H3)/M3)","v":0.41992449678800853},{"$f":"IF(I3=0,\"\",(L3-I3)/L3)","v":""},135447.63,null,{"$f":"'Simplified P&L'!$B$55","v":50},null,{"$f":"'Simplified P&L'!$B$58","v":50},null,{"$f":"'Simplified P&L'!$B$59","v":65},null,{"$f":"'Simplified P&L'!$B$60","v":40}]
[0,"EQUIPMENT","MECA","BASE","Manifold",null,1,9000,0,9000,{"$f":"ROUND(H4/0.58,-2)","v":15500},null,15500,15500,6500,0.41935483870967744,{"$f":"IF(G4=\"\",\"\",(M4-H4)/M4)","v":0.41935483870967744},{"$f":"IF(I4=0,\"\",(L4-I4)/L4)","v":""},9000,null,{"$f":"'Simplified P&L'!$B$55","v":50},null,{"$f":"'Simplified P&L'!$B$58","v":50},null,{"$f":"'Simplified P&L'!$B$59","v":65},null,{"$f":"'Simplified P&L'!$B$60","v":40}]
[0,"EQUIPMENT","MECA","BASE","Filtrate Receiver 1",null,1,{"$f":"+S5*G5","v":3878},{"$f":"T5*U5+V5*W5+X5*Y5+Z5*AA5","v":0},{"$f":"I5+H5","v":3878},6700,null,{"$f":"G5*K5","v":6700},{"$f":"M5+L5","v":6700},{"$f":"+N5-H5","v":2822},{"$f":"IF(G5=\"\",\"\",+O5/N5)","v":0.42119402985074628},{"$f":"IF(G5=\"\",\"\",(M5-H5)/M5)","v":0.42119402985074628},{"$f":"IF(I5=0,\"\",(L5-I5)/L5)","v":""},3878,null,{"$f":"'Simplified P&L'!$B$55","v":50},null,{"$f":"'Simplified P&L'!$B$58","v":50},null,{"$f":"'Simplified P&L'!$B$59","v":65},null,{"$f":"'Simplified P&L'!$B$60","v":40}]
[0,"EQUIPMENT","MECA","BASE","Liquid Ring Water Recirculating Tank",null,1,4000,0,4000,6900,null,6900,6900,2900,0.42028985507246375,0.42028985507246375,"",4000,null,{"$f":"'Simplified P&L'!$B$55","v":50},null,{"$f":"'Simplified P&L'!$B$58","v":50},null,{"$f":"'Simplified P&L'!$B$59","v":65},null,{"$f":"'Simplified P&L'!$B$60","v":40}]
[0,"EQUIPMENT","MECA","BASE","Cloth & Belt Wash Recirculating Tank",null,1,4000,0,4000,6900,null,6900,6900,2900,0.42028985507246375,0.42028985507246375,"",4000,null,{"$f":"'Simplified P&L'!$B$55","v":50},null,{"$f":"'Simplified P&L'!$B$58","v":50},null,{"$f":"'Simplified P&L'!$B$59","v":65},null,{"$f":"'Simplified P&L'!$B$60","v":40}]
[0,"EQUIPMENT","MECA","BASE","Filtrate Pump 1",null,1,7000,0,7000,12100,null,12100,12100,5100,0.42148760330578511,0.42148760330578511,"",7000,null,{"$f":"'Simplified P&L'!$B$55","v":50},null,{"$f":"'Simplified P&L'!$B$58","v":50},null,{"$f":"'Simplified P&L'!$B$59","v":65},null,{"$f":"'Simplified P&L'!$B$60","v":40}]
[0,"EQUIPMENT","MECA","BASE","Liquid Ring Water Recirculating Pump",null,1,{"$f":"+S9*G9","v":6000},{"$f":"T9*U9+V9*W9+X9*Y9+Z9*AA9","v":0},{"$f":"I9+H9","v":6000},10300,null,{"$f":"G9*K9","v":10300},{"$f":"M9+L9","v":10300},{"$f":"+N9-H9","v":4300},{"$f":"IF(G9=\"\",\"\",+O9/N9)","v":0.41747572815533979},{"$f":"IF(G9=\"\",\"\",(M9-H9)/M9)","v":0.41747572815533979},{"$f":"IF(I9=0,\"\",(L9-I9)/L9)","v":""},6000,null,{"$f":"'Simplified P&L'!$B$55","v":50},null,{"$f":"'Simplified P&L'!$B$58","v":50},null,{"$f":"'Simplified P&L'!$B$59","v":65},null,{"$f":"'Simplified P&L'!$B$60","v":40}]
[0,"EQUIPMENT","MECA","BASE","Cloth & Belt Wash Recirculating Pump",null,1,6000,0,6000,10300,null,10300,10300,4300,0.41747572815533979,0.41747572815533979,"",6000,null,{"$f":"'Simplified P&L'!$B$55","v":50},null,{"$f":"'Simplified P&L'!$B$58","v":50},null,{"$f":"'Simplified P&L'!$B$59","v":65},null,{"$f":"'Simplified P&L'!$B$60","v":40}]
[0,"EQUIPMENT","MECA","BASE","Vacuum Pump",null,1,83970.75,0,83970.75,144800,null,144800,144800,60829.25,0.42009150552486185,0.42009150552486185,"",83970.75,null,{"$f":"'Simplified P&L'!$B$55","v":50},null,{"$f":"'Simplified P&L'!$B$58","v":50},null,{"$f":"'Simplified P&L'!$B$59","v":65},null,{"$f":"'Simplified P&L'!$B$60","v":40}]
[0,"EQUIPMENT","ELEC","BASE","Local Control Panel",null,1,{"$f":"+S12*G12","v":3975},{"$f":"T12*U12+V12*W12+X12*Y12+Z12*AA12","v":0},{"$f":"I12+H12","v":3975},6900,null,{"$f":"G12*K12","v":6900},{"$f":"M12+L12","v":6900},{"$f":"+N12-H12","v":2925},{"$f":"IF(G12=\"\",\"\",+O12/N12)","v":0.42391304347826086},{"$f":"IF(G12=\"\",\"\",(M12-H12)/M12)","v":0.42391304347826086},{"$f":"IF(I12=0,\"\",(L12-I12)/L12)","v":""},3975,null,{"$f":"'Simplified P&L'!$B$55","v":50},null,{"$f":"'Simplified P&L'!$B$58","v":50},null,{"$f":"'Simplified P&L'!$B$59","v":65},null,{"$f":"'Simplified P&L'!$B$60","v":40}]
[0,"EQUIPMENT","ELEC","BASE","Instrumentation & Valves",null,1,9400,0,9400,16200,null,16200,16200,6800,0.41975308641975306,0.41975308641975306,"",9400,null,{"$f":"'Simplified P&L'!$B$55","v":50},null,{"$f":"'Simplified P&L'!$B$58","v":50},null,{"$f":"'Simplified P&L'!$B$59","v":65},null,{"$f":"'Simplified P&L'!$B$60","v":40}]
[0,"EQUIPMENT","MECA","BASE","Engineering",null,1]
[0,"EQUIPMENT","MECA","BASE","Fume Hood",null,1,{"$f":"+S15*G15","v":8123},{"$f":"T15*U15+V15*W15+X15*Y15+Z15*AA15","v":0},{"$f":"I15+H15","v":8123},{"$f":"ROUND(H15/0.6,-2)","v":13500},null,{"$f":"G15*K15","v":13500},{"$f":"M15+L15","v":13500},{"$f":"+N15-H15","v":5377},{"$f":"IF(G15=\"\",\"\",+O15/N15)","v":0.39829629629629631},{"$f":"IF(G15=\"\",\"\",(M15-H15)/M15)","v":0.39829629629629631},{"$f":"IF(I15=0,\"\",(L15-I15)/L15)","v":""},8123,null,{"$f":"'Simplified P&L'!$B$55","v":50},null,{"$f":"'Simplified P&L'!$B$58","v":50},null,{"$f":"'Simplified P&L'!$B$59","v":65},null,{"$f":"'Simplified P&L'!$B$60","v":40}]
{"$rows_left_out":23}
{"sheet":"Budget Price Final order","index":3,"n_rows":41,"n_cols":27,"rows_kept":41,"cut":false,"hidden":false,"merged":[[0,19,0,26]]}
[null,null,null,null,null,null,null,null,null,null,null,null,null,null,null,null,null,null,null,"DIRECT HOURS SOLD"]
["Position","Type of Eqpt","Meca/Elec","Base / Options","DESCRIPTION","RÉFÉRENCE","QTY","TOTAL EQ Cost","TOTAL Hours cost","TOTAL Cost","EQ Unit selling price","Total Hours Selling Price","TOTAL EQ Selling Price","TOTAL Selling Price","Gross Margin on Direct External Costs","Gross Margin on Direct External Costs","Margin on EQ","Margin on hours","EQ Unit Cost ","Nb hours TECH","Hours Unit Cost","Nb hours PUR","Hours Unit Cost","Nb hours PM","Hours Unit Cost","Nb hours WORKSHOP","Hours Unit Cost"]
[1,"EQUIPMENT","MECA","BASE","Horizontal Vaccum Belt Filter 6B10 (6m²)",null,1,{"$f":"+S3*G3","v":116900},{"$f":"T3*U3+V3*W3+X3*Y3+Z3*AA3","v":0},{"$f":"I3+H3","v":116900},243000,null,{"$f":"G3*K3","v":243000},{"$f":"M3+L3","v":243000},{"$f":"+N3-H3","v":126100},{"$f":"IF(G3=\"\",\"\",+O3/N3)","v":0.51893004115226338},{"$f":"IF(G3=\"\",\"\",(M3-H3)/M3)","v":0.51893004115226338},{"$f":"IF(I3=0,\"\",(L3-I3)/L3)","v":""},{"$f":"113000+3900","v":116900},null,{"$f":"'Simplified P&L'!$B$55","v":50},null,{"$f":"'Simplified P&L'!$B$58","v":50},null,{"$f":"'Simplified P&L'!$B$59","v":65},null,{"$f":"'Simplified P&L'!$B$60","v":40}]
[1,"EQUIPMENT","MECA","BASE","Manifold",null,1,6721,{"$f":"T4*U4+V4*W4+X4*Y4+Z4*AA4","v":0},6721,{"$f":"ROUND(H4/0.48,-3)","v":14000},null,14000,14000,7279,{"$f":"IF(G4=\"\",\"\",+O4/N4)","v":0.51992857142857141},{"$f":"IF(G4=\"\",\"\",(M4-H4)/M4)","v":0.51992857142857141},{"$f":"IF(I4=0,\"\",(L4-I4)/L4)","v":""},6721,null,{"$f":"'Simplified P&L'!$B$55","v":50},null,{"$f":"'Simplified P&L'!$B$58","v":50},null,{"$f":"'Simplified P&L'!$B$59","v":65},null,{"$f":"'Simplified P&L'!$B$60","v":40}]
[1,"EQUIPMENT","MECA","BASE","Filtrate Receiver 1",null,1,9890,0,9890,21000,null,21000,21000,11110,0.5290476190476191,0.5290476190476191,"",9890,null,{"$f":"'Simplified P&L'!$B$55","v":50},null,{"$f":"'Simplified P&L'!$B$58","v":50},null,{"$f":"'Simplified P&L'!$B$59","v":65},null,{"$f":"'Simplified P&L'!$B$60","v":40}]
[1,"EQUIPMENT","MECA","BASE","Conical Cloth & Belt Wash Recirculating Tank",null,1,2894,0,2894,6000,null,6000,6000,3106,0.51766666666666672,0.51766666666666672,"",2894,null,{"$f":"'Simplified P&L'!$B$55","v":50},null,{"$f":"'Simplified P&L'!$B$58","v":50},null,{"$f":"'Simplified P&L'!$B$59","v":65},null,{"$f":"'Simplified P&L'!$B$60","v":40}]
[1,"EQUIPMENT","MECA","BASE","Filtrate Pump 1",null,1,11071,0,11071,23000,null,23000,23000,11929,0.51865217391304352,0.51865217391304352,"",11071,null,{"$f":"'Simplified P&L'!$B$55","v":50},null,{"$f":"'Simplified P&L'!$B$58","v":50},null,{"$f":"'Simplified P&L'!$B$59","v":65},null,{"$f":"'Simplified P&L'!$B$60","v":40}]
[1,"EQUIPMENT","MECA","BASE","Cloth & Belt Wash Recirculating Pump",null,1,{"$f":"+S8*G8","v":10493},{"$f":"T8*U8+V8*W8+X8*Y8+Z8*AA8","v":0},{"$f":"I8+H8","v":10493},22000,null,{"$f":"G8*K8","v":22000},{"$f":"M8+L8","v":22000},{"$f":"+N8-H8","v":11507},{"$f":"IF(G8=\"\",\"\",+O8/N8)","v":0.52304545454545459},0.52304545454545459,{"$f":"IF(I8=0,\"\",(L8-I8)/L8)","v":""},10493,null,{"$f":"'Simplified P&L'!$B$55","v":50},null,{"$f":"'Simplified P&L'!$B$58","v":50},null,{"$f":"'Simplified P&L'!$B$59","v":65},null,{"$f":"'Simplified P&L'!$B$60","v":40}]
[1,"EQUIPMENT","MECA","BASE","Vacuum Pump",null,1,27604.799999999999,0,27604.799999999999,58000,null,58000,58000,30395.200000000001,0.52405517241379307,0.52405517241379307,"",27604.799999999999,null,{"$f":"'Simplified P&L'!$B$55","v":50},null,{"$f":"'Simplified P&L'!$B$58","v":50},null,{"$f":"'Simplified P&L'!$B$59","v":65},null,{"$f":"'Simplified P&L'!$B$60","v":40}]
[1,"EQUIPMENT","MECA","BASE","Fume Hood",null,1,8122.57,0,8122.57,17000,null,17000,17000,8877.43,0.52220176470588242,0.52220176470588242,"",8122.57,null,{"$f":"'Simplified P&L'!$B$55","v":50},null,{"$f":"'Simplified P&L'!$B$58","v":50},null,{"$f":"'Simplified P&L'!$B$59","v":65},null,{"$f":"'Simplified P&L'!$B$60","v":40}]
[1,"EQUIPMENT","MECA","BASE","Drip Pan",null,1,6628.9,0,6628.9,14000,null,14000,14000,7371.1,0.52650714285714284,0.52650714285714284,"",6628.9,null,{"$f":"'Simplified P&L'!$B$55","v":50},null,{"$f":"'Simplified P&L'!$B$58","v":50},null,{"$f":"'Simplified P&L'!$B$59","v":65},null,{"$f":"'Simplified P&L'!$B$60","v":40}]
[1,"EQUIPMENT","ELEC","BASE","Local Control Panel",null,1,{"$f":"+S12*G12","v":3975},{"$f":"T12*U12+V12*W12+X12*Y12+Z12*AA12","v":0},{"$f":"I12+H12","v":3975},8000,null,{"$f":"G12*K12","v":8000},{"$f":"M12+L12","v":8000},{"$f":"+N12-H12","v":4025},{"$f":"IF(G12=\"\",\"\",+O12/N12)","v":0.50312500000000004},0.50312500000000004,{"$f":"IF(I12=0,\"\",(L12-I12)/L12)","v":""},3975,null,{"$f":"'Simplified P&L'!$B$55","v":50},null,{"$f":"'Simplified P&L'!$B$58","v":50},null,{"$f":"'Simplified P&L'!$B$59","v":65},null,{"$f":"'Simplified P&L'!$B$60","v":40}]
[1,"EQUIPMENT","MECA","BASE","Instrumentation & Valves",null,1,8900,0,8900,19000,null,19000,19000,10100,0.53157894736842104,0.53157894736842104,"",8900,null,{"$f":"'Simplified P&L'!$B$55","v":50},null,{"$f":"'Simplified P&L'!$B$58","v":50},null,{"$f":"'Simplified P&L'!$B$59","v":65},null,{"$f":"'Simplified P&L'!$B$60","v":40}]
[1,{"$f":"'Simplified P&L'!$G$3","v":"EQUIPMENT"},"MECA","OPTIONS","Set of Bolts/Fasteners",null,1,{"$f":"+S14*G14","v":2000},{"$f":"T14*U14+V14*W14+X14*Y14+Z14*AA14","v":0},{"$f":"I14+H14","v":2000},4000,null,{"$f":"G14*K14","v":4000},{"$f":"M14+L14","v":4000},{"$f":"+N14-H14","v":2000},{"$f":"IF(G14=\"\",\"\",+O14/N14)","v":0.5},{"$f":"IF(G14=\"\",\"\",(M14-H14)/M14)","v":0.5},{"$f":"IF(I14=0,\"\",(L14-I14)/L14)","v":""},2000,null,{"$f":"'Simplified P&L'!$B$55","v":50},null,{"$f":"'Simplified P&L'!$B$58","v":50},null,{"$f":"'Simplified P&L'!$B$59","v":65},null,{"$f":"'Simplified P&L'!$B$60","v":40}]
[1,"EQUIPMENT","MECA","BASE","Engineering",null,1,{"$f":"+S15*G15","v":0},{"$f":"T15*U15+V15*W15+X15*Y15+Z15*AA15","v":2600},{"$f":"I15+H15","v":2600},null,{"$f":"ROUND(I15/0.55,-3)","v":5000},{"$f":"G15*K15","v":0},{"$f":"M15+L15","v":5000},{"$f":"+N15-H15","v":5000},{"$f":"IF(G15=\"\",\"\",+O15/N15)","v":1},{"$f":"IF(G15=\"\",\"\",(M15-H15)/M15)","v":{"$error":"#DIV/0!"}},{"$f":"IF(I15=0,\"\",(L15-I15)/L15)","v":0.48},null,null,{"$f":"'Simplified P&L'!$B$55","v":50},null,{"$f":"'Simplified P&L'!$B$58","v":50},40,{"$f":"'Simplified P&L'!$B$59","v":65},null,{"$f":"'Simplified P&L'!$B$60","v":40}]
{"$rows_left_out":27}
{"sheet":"Budget Target","index":4,"n_rows":50,"n_cols":12,"rows_kept":50,"cut":false,"hidden":false,"merged":[]}
["BUDGET TARGET HF"]
[]
[]
[null,"RUBRIQUE ANALYTIQUE","DAS","Margin Rate Target 2023"]
[null,"EQUIPMENT","DOSING",0.46500000000000002,"01/01/2024 -update dans P&L le 19/03/2024"]
[null,"EQUIPMENT","FILTRATION",0.37]
[null,"EQUIPMENT","MIXING",0.27]
[null,"EQUIPMENT","PROCESSING",0.5]
[null,"REVAMPING","DOSING",0.49,"01/01/2024 -update dans P&L le 19/03/2024"]
[null,"REVAMPING","FILTRATION",0.39]
[null,"REVAMPING","MIXING",0.45]
[null,"REVAMPING","PROCESSING",0.5]
[null,"PORT","DOSING",0.25]
[null,{"$f":"+B13","v":"PORT"},"FILTRATION",0.25]
[null,{"$f":"+B14","v":"PORT"},"MIXING",0.25]
{"$rows_left_out":36}
{"sheet":"Configuration","index":5,"n_rows":85,"n_cols":36,"rows_kept":85,"cut":false,"hidden":false,"merged":[]}
[]
["Offer language","English",null,null,null,null,null,null,null,null,null,null,null,null,null,"LISTES DEROULANTES",null,null,"T eng.",null,null,null,"ASM",null,null,null,"Market",null,null,null,null,"DAS","English","French","Chinese"]
[null,null,null,null,null,null,null,null,null,null,null,null,null,null,null,null,null,null,"ABOU","Tender engineer","Ahssen Boudeheb","a.boudeheb@hasler.group","ABNA","Business Developer Service & Spare","Alain Bernard Nankam","ab.nankam@hasler.group","CCH - A2 Cement",null,null,null,null,"DOSING","Dosing system","Solution de dosage"]
["Budget proposal","No",null,null,null,null,null,null,null,null,null,null,null,null,null,"DAS","TAC",null,"AGIB","Tender engineer","Alexis Gilbert","a.gilbert@hasler.group","AHOU","Business Development Manager","Adrien Hourlier","a.hourlier@hasler.group","CCH - E4 Technical Silica (and Bulk)",null,null,null,null,"FILTRATION","Filtration system","Solution de filtration"]
[null,null,null,null,null,null,null,null,null,null,null,null,null,null,null,"DOSING","EQUIPMENT",null,"ANGO","Tender engineer","Ahou N'gotta","ac.n'gotta@hasler.group","BROU","Area Technical Sales Manager","Benoît Roudaut","b.roudaut@hasler.group","CCH - F5 Cement and kiln dust dosing",null,null,null,null,"MIXING","Mixing system","Solution d'agitation "]
["Customer reference",null,null,null,null,null,null,null,null,null,null,null,null,null,null,"FILTRATION ","REVAMPING",null,"BJOL","Filtration Product Manager","Baptiste Joly","b.joly@hasler.group","CPIS","Area Sales Manager","Cosimo Piscopiello","c.piscopiello@hasler.group","CCH - H4 Soda Ash",null,null,null,null,"PROCESSING","Kneading system","Solution de malaxage "]
[null,null,null,null,null,null,null,null,null,null,null,null,null,null,null,"MIXING","SPARE PARTS",null,"BROU","Area Technical Sales Manager","Benoît Roudaut","b.roudaut@hasler.group","DCRI","Area Sales Manager","Daniel Criado","d.criado@hasler.group","CCH - other",null,null,null,null,null,"Offer","Offre commerciale"]
[null,null,null,null,null,null,null,null,null,null,null,null,null,null,null,"PROCESSING","SERVICE",null,"CCHA","Tender engineer","Chenghao Chai","c.chai@hasler.group","EGUA","Process Engineer","Enrico Gualdi","e.gualdi@hasler.group","MMF - A1 Phosphoric Acid",null,null,null,null,null,"Customer reference","Référence client"]
[null,null,null,null,null,null,null,null,null,null,null,null,null,null,null,null,"OTHER",null,"EGUA","Process Engineer","Enrico Gualdi","e.gualdi@hasler.group","EVAQ","Area Sales Manager","Emilie Vaquero","e.vaquero@hasler.group","MMF - A3 Phosphate Rock",null,null,null,null,null,"Customer","Client"]
[null,null,null,null,null,null,null,null,null,null,null,null,null,null,null,null,null,null,"KSCH","Tender engineer","Konstantin Schilow","k.schilow@hasler.group","LLI","Area Sales Manager","Leo Li","l.li@hasler.group","MMF - B1 Phosphated Fertilizers (MAP,DAP,TSP,DCP …)",null,null,null,null,null,"Table of Contents","Sommaire"]
[null,null,null,null,null,null,null,null,null,null,null,null,null,null,null,"MECA","BASE",null,"MBAL","Trial Technician Filtration","Mélisa Balguy","m.balguy@hasler.group","LMEN","Sales & Marketing Director","Laurent Menigoz","l.menigoz@hasler.group","MMF - I3 Lithium",null,null,null,null,null,"Cover Letter","Lettre d'introduction"]
[null,null,null,null,null,null,null,null,null,null,null,null,null,null,null,"ELEC","OPTIONS",null,"VRUY","Process & Product Director","Victor Ruys","v.ruys@hasler.group","LZHA","Area Sales Manager","Li Zhang","l.zhang@hasler.group","MMF - L3 Zinc and cadmium",null,null,null,null,null,"Price List","Liste de prix"]
[null,null,null,null,null,null,null,null,null,null,null,null,null,null,null,null,"SERVICES",null,"YMAR","Dosing Product Manager","Yuri Marcuzzo","y.marcuzzo@hasler.group","MJAM","Sales Director","Michel Jamey","m.jamey@hasler.group","MMF - N3 Nickel, Cobalt and Manganese",null,null,null,null,null,"Special Terms of Sales","Conditions particulières de vente"]
[null,null,null,null,null,null,null,null,null,null,null,null,null,null,null,null,null,null,null,null,null,null,"NDEL","Business Development Manager","Nicolas Delattre","n.delattre@hasler.group","MMF - Other",null,null,null,null,null,"Delivery Time","Délai de livraison"]
[null,null,null,null,null,null,null,null,null,null,null,null,null,null,null,"12 months after commissioning, latest 18 months after delivery","12 mois après la mise en service, maximum 18 mois après livraison",null,null,null,null,null,"PTES","Area Sales Manager","Phirun Tes","p.tes@hasler.group","ENV - A5 FGD (Flue-gas & kiln dust/alternative fuels desulfurization)",null,null,null,null,null,"Terms of Payment","Conditions de paiement"]
{"$rows_left_out":71}
{"sheet":"Main cover","index":6,"n_rows":38,"n_cols":10,"rows_kept":38,"cut":false,"hidden":false,"merged":[[37,8,37,9],[14,2,14,8]]}
[]
[]
[]
[]
[]
[]
[]
[]
[]
[]
[]
[]
[]
[]
[null,null,"INSERT TEMPLATE"]
{"$rows_left_out":24}
{"sheet":"cover_L","index":7,"n_rows":67,"n_cols":25,"rows_kept":67,"cut":false,"hidden":false,"merged":[[23,2,23,24],[25,2,25,24]]}
[]
[]
[]
[]
[]
[null,{"$f":"IF(Configuration!B2=\"Français\",Configuration!AH10,Configuration!AG10)","v":"Table of Contents"}]
[]
[null,null,{"$f":"IF(Configuration!B2=\"Français\",Configuration!AH11,Configuration!AG11)","v":"Cover Letter"}]
[null,null,{"$f":"IF(Configuration!B2=\"Français\",Configuration!AH12,Configuration!AG12)","v":"Price List"}]
[null,null,{"$f":"IF(Configuration!B2=\"Français\",Configuration!AH13,Configuration!AG13)","v":"Special Terms of Sales"}]
[null,null,null,{"$f":"IF(Configuration!B2=\"Français\",Configuration!AH14,Configuration!AG14)","v":"Delivery Time"}]
[null,null,null,"INCOTERM"]
[null,null,null,{"$f":"IF(Configuration!B2=\"Français\",Configuration!AH15,Configuration!AG15)","v":"Terms of Payment"}]
[null,null,null,{"$f":"IF(Configuration!B2=\"Français\",Configuration!AH16,Configuration!AG16)","v":"Warranty"}]
[null,null,null,{"$f":"IF(Configuration!B2=\"Français\",Configuration!AH17,Configuration!AG17)","v":"Validity "}]
{"$rows_left_out":53}
{"sheet":"PRICE_LIST","index":8,"n_rows":54,"n_cols":3,"rows_kept":54,"cut":false,"hidden":false,"merged":[[26,1,26,2],[26,3,26,12],[26,13,26,16],[29,26,33,35]]}
[]
[]
[null,{"$f":"CONCATENATE(IF(Configuration!B2=\"Français\",Configuration!AH12,Configuration!AG12),\" - \",IF(Configuration!B2=\"Français\",Configuration!AH26,Configuration!AG26),\" n° \",'Simplified P&L'!B2,\"-\",'Simplified P&L'!B3)","v":"Price List - Offer n° 732482-1 AMENDMENT #1"}]
[]
[]
[]
[]
[]
[]
[]
[]
[]
[]
[]
[]
{"$rows_left_out":40}
{"sheet":"STS","index":9,"n_rows":81,"n_cols":23,"rows_kept":81,"cut":false,"hidden":false,"merged":[[79,1,79,28],[38,1,38,28],[44,1,44,28],[60,1,60,4],[60,5,60,10],[60,11,60,16],[60,17,60,26],[73,1,73,4],[73,5,73,10],[73,11,73,16],[73,17,73,26],[71,5,71,10],[71,11,71,16],[71,17,71,26],[72,1,72,4],[72,5,72,10],[6,1,7,26],[8,1,9,26],[10,1,14,26],[72,11,72,16],[72,17,72,26],[58,5,58,10],[58,11,58,16],[58,17,58,26],[32,1,34,26],[59,1,59,4],[59,5,59,10],[59,11,59,16],[59,17,59,26],[40,1,40,28],[24,1,24,3],[24,4,24,8],[24,9,24,16],[24,17,24,21],[24,22,24,26],[25,22,25,26],[26,1,26,3],[26,4,26,8],[26,9,26,16],[26,17,26,21],[26,22,26,26],[25,1,25,3],[25,4,25,8],[25,9,25,16],[25,17,25,21],[27,1,27,3],[27,4,27,8],[27,9,27,16],[27,17,27,21],[27,22,27,26],[28,1,28,3],[28,4,28,8],[28,9,28,16],[28,17,28,21],[28,22,28,26],[29,1,29,3],[29,4,29,8],[29,9,29,16],[29,17,29,21],[29,22,29,26],[30,1,30,3],[30,4,30,8],[30,9,30,16],[30,17,30,21],[30,22,30,26]]}
[]
[]
[null,{"$f":"IF(Configuration!B2=\"Français\",CONCATENATE(Configuration!AH13,\" - \",Configuration!AH26,\" n° \",'Simplified P&L'!B2),CONCATENATE(Configuration!AG13,\" - \",Configuration!AG26,\" N° \",'Simplified P&L'!B2,\"-\",'Simplified P&L'!B3))","v":"Special Terms of Sales - Offer N° 732482-1 AMENDMENT #1"}]
[]
[null,{"$f":"cover_L!D11","v":"Delivery Time"}]
[]
[null,{"$f":"IF(Configuration!B2=\"Français\",IF(MID('Simplified P&L'!G5,2,1)=\"\",LEFT('Simplified P&L'!G5,1) & Configuration!AH50,LEFT('Simplified P&L'!G5,2) & \" \" & Configuration!AH50),'Simplified P&L'!G5)","v":"Upon our prior agreement"}]
[]
[null,{"$f":"IF(Configuration!B2=\"Français\",Configuration!AH27,Configuration!AG27)","v":"Please take into account additional time for delivery of the goods to the contractual incoterm place of destination (to be confirmed after order)"}]
[]
[null,{"$f":"IF(Configuration!B2=\"Français\",Configuration!AH28,Configuration!AG28)","v":"The delivery time is estimated and will be confirmed upon receipt of your order to account for the factory load at the time of processing your order.\nThe lead time runs from the receipt of the advance payment due upon ordering. It will be extended by any delay that may occur in order to receive additionally agreed payment instalments. No work will be started before receipt of the agreed advance payment. It is the responsibility of the customer to provide all technical data and intermediary approvals in a timely manner in order to allow the nominal progress of the design, manufacturing and documentation work. Any delay in doing so will affect the global lead time without any liability to Hasler"}]
[]
[]
[]
[]
{"$rows_left_out":67}
{"sheet":"GTC","index":10,"n_rows":203,"n_cols":2,"rows_kept":203,"cut":false,"hidden":false,"merged":[[51,1,97,29],[101,1,147,29],[1,0,1,30],[152,1,194,29],[202,1,244,29]]}
[]
["DISCOVER HASLER GROUP"]
[]
[]
[]
[]
[]
[]
[]
[]
[]
[]
[]
[]
[]
{"$rows_left_out":188}